BDBM50443425 CHEMBL3087430
SMILES: Oc1cc(Oc2c(cc(c(Cl)c2[N+]([O-])=O)C(F)(F)F)[N+]([O-])=O)cc2OC(CC(=O)c12)c1ccc(Oc2c(cc(c(Cl)c2[N+]([O-])=O)C(F)(F)F)[N+]([O-])=O)cc1
InChI Key: InChIKey=PQQWNGBULDOTTM-UHFFFAOYSA-N
Data: 1 IC50
Activity Spreadsheet -- Enzyme Inhibition Constant Data from BindingDB
Found 1 hit for monomerid = 50443425
Trg + Lig
Ki
nM
ΔG°
kcal/mole
IC50
nM
Kd
nM
EC50/IC50
nM
koff
s-1
kon
M-1s-1
pHTemp
°C
Kinesin-like protein 1
(Homo sapiens (Human))
BDBM50443425
(CHEMBL3087430)
Show SMILES Oc1cc(Oc2c(cc(c(Cl)c2[N+]([O-])=O)C(F)(F)F)[N+]([O-])=O)cc2OC(CC(=O)c12)c1ccc(Oc2c(cc(c(Cl)c2[N+]([O-])=O)C(F)(F)F)[N+]([O-])=O)cc1
Show InChI InChI=1S/C29H12Cl2F6N4O13/c30-22-13(28(32,33)34)7-15(38(44)45)26(24(22)40(48)49)52-11-3-1-10(2-4-11)19-9-18(43)21-17(42)5-12(6-20(21)54-19)53-27-16(39(46)47)8-14(29(35,36)37)23(31)25(27)41(50)51/h1-8,19,42H,9H2
Reactome pathway
n/an/a 52n/an/an/an/an/an/a
Nanjing University
Curated by ChEMBL
Assay Description
Inhibition of C-terminal His-tagged microtubule-stimulated KSP motor domain (1 to 369) ATPase activity (unknown origin) preincubated for 30 mins foll...
Eur J Med Chem 70: 427-33 (2013)
Article DOI: 10.1016/j.ejmech.2013.09.042
BindingDB Entry DOI: 10.7270/Q289179H