null
SMILES: NCCOCCOCCO
InChI Key: InChIKey=ASDQMECUMYIVBG-UHFFFAOYSA-N
Activity Spreadsheet -- Enzyme Inhibition Constant Data from BindingDB
Found 11 hits for monomerid = 50443640
Trg + Lig
Ki
nM
ΔG°
kcal/mole
IC50
nM
Kd
nM
EC50/IC50
nM
koff
s-1
kon
M-1s-1
pHTemp
°C
Dual specificity protein kinase CLK3
(Mus musculus)
BDBM50443640
(CHEMBL3092861)
Show SMILES NCCOCCOCCO
Show InChI InChI=1S/C6H15NO3/c7-1-3-9-5-6-10-4-2-8/h8H,1-7H2
n/an/a>1.00E+4n/an/an/an/an/an/a
Universit£ de Rennes 1
Curated by ChEMBL
Assay Description
Inhibition of mouse recombinant CLK3 expressed in Escherichia coli using GRSRSRSRSRSR as substrate
Eur J Med Chem 62: 728-37 (2013)
Article DOI: 10.1016/j.ejmech.2013.01.035
BindingDB Entry DOI: 10.7270/Q2T1553Q
Dual specificity protein kinase CLK2
(Mus musculus)
BDBM50443640
(CHEMBL3092861)
Show SMILES NCCOCCOCCO
Show InChI InChI=1S/C6H15NO3/c7-1-3-9-5-6-10-4-2-8/h8H,1-7H2
n/an/a>1.00E+4n/an/an/an/an/an/a
Universit£ de Rennes 1
Curated by ChEMBL
Assay Description
Inhibition of mouse recombinant CLK2 expressed in Escherichia coli using GRSRSRSRSRSR as substrate
Eur J Med Chem 62: 728-37 (2013)
Article DOI: 10.1016/j.ejmech.2013.01.035
BindingDB Entry DOI: 10.7270/Q2T1553Q
Dual specificity protein kinase CLK1
(Mus musculus)
BDBM50443640
(CHEMBL3092861)
Show SMILES NCCOCCOCCO
Show InChI InChI=1S/C6H15NO3/c7-1-3-9-5-6-10-4-2-8/h8H,1-7H2
n/an/a>1.00E+4n/an/an/an/an/an/a
Universit£ de Rennes 1
Curated by ChEMBL
Assay Description
Inhibition of mouse recombinant CLK1 expressed in Escherichia coli using GRSRSRSRSRSR as substrate
Eur J Med Chem 62: 728-37 (2013)
Article DOI: 10.1016/j.ejmech.2013.01.035
BindingDB Entry DOI: 10.7270/Q2T1553Q
Cyclin-T1/Cyclin-dependent kinase 9
(Homo sapiens (Human))
BDBM50443640
(CHEMBL3092861)
Show SMILES NCCOCCOCCO
Show InChI InChI=1S/C6H15NO3/c7-1-3-9-5-6-10-4-2-8/h8H,1-7H2
Reactome pathway
n/an/a>1.00E+4n/an/an/an/an/an/a
Universit£ de Rennes 1
Curated by ChEMBL
Assay Description
Inhibition of human recombinant CDK9/cyclin T using YSPTSPSYSPTSPSYSPTSPSKKKK as substrate
Eur J Med Chem 62: 728-37 (2013)
Article DOI: 10.1016/j.ejmech.2013.01.035
BindingDB Entry DOI: 10.7270/Q2T1553Q
Cyclin-dependent kinase 5 activator 1
(Homo sapiens (Human))
BDBM50443640
(CHEMBL3092861)
Show SMILES NCCOCCOCCO
Show InChI InChI=1S/C6H15NO3/c7-1-3-9-5-6-10-4-2-8/h8H,1-7H2
NCI pathway
Reactome pathway
n/an/a>1.00E+4n/an/an/an/an/an/a
Universit£ de Rennes 1
Curated by ChEMBL
Assay Description
Inhibition of human recombinant CDK5/p25 using [gamma-33P]-ATP after 30 mins by scintillation counting
Eur J Med Chem 62: 728-37 (2013)
Article DOI: 10.1016/j.ejmech.2013.01.035
BindingDB Entry DOI: 10.7270/Q2T1553Q
Dual specificity protein kinase CLK4
(Mus musculus)
BDBM50443640
(CHEMBL3092861)
Show SMILES NCCOCCOCCO
Show InChI InChI=1S/C6H15NO3/c7-1-3-9-5-6-10-4-2-8/h8H,1-7H2
n/an/a>1.00E+4n/an/an/an/an/an/a
Universit£ de Rennes 1
Curated by ChEMBL
Assay Description
Inhibition of mouse recombinant CLK4 expressed in Escherichia coli using GRSRSRSRSRSR as substrate
Eur J Med Chem 62: 728-37 (2013)
Article DOI: 10.1016/j.ejmech.2013.01.035
BindingDB Entry DOI: 10.7270/Q2T1553Q
Dual specificity tyrosine-phosphorylation-regulated kinase 3
(Homo sapiens (Human))
BDBM50443640
(CHEMBL3092861)
Show SMILES NCCOCCOCCO
Show InChI InChI=1S/C6H15NO3/c7-1-3-9-5-6-10-4-2-8/h8H,1-7H2
n/an/a>1.00E+4n/an/an/an/an/an/a
Universit£ de Rennes 1
Curated by ChEMBL
Assay Description
Inhibition of human recombinant DYRK3 expressed in Escherichia coli using GRSRSRSRSRSR as substrate
Eur J Med Chem 62: 728-37 (2013)
Article DOI: 10.1016/j.ejmech.2013.01.035
BindingDB Entry DOI: 10.7270/Q2T1553Q
Dual specificity tyrosine-phosphorylation-regulated kinase 2
(Homo sapiens (Human))
BDBM50443640
(CHEMBL3092861)
Show SMILES NCCOCCOCCO
Show InChI InChI=1S/C6H15NO3/c7-1-3-9-5-6-10-4-2-8/h8H,1-7H2
NCI pathway
n/an/a>1.00E+4n/an/an/an/an/an/a
Universit£ de Rennes 1
Curated by ChEMBL
Assay Description
Inhibition of human recombinant DYRK2 expressed in Escherichia coli using GRSRSRSRSRSR as substrate
Eur J Med Chem 62: 728-37 (2013)
Article DOI: 10.1016/j.ejmech.2013.01.035
BindingDB Entry DOI: 10.7270/Q2T1553Q
Dual specificity tyrosine-phosphorylation-regulated kinase 1B
(Homo sapiens (Human))
BDBM50443640
(CHEMBL3092861)
Show SMILES NCCOCCOCCO
Show InChI InChI=1S/C6H15NO3/c7-1-3-9-5-6-10-4-2-8/h8H,1-7H2
n/an/a>1.00E+4n/an/an/an/an/an/a
Universit£ de Rennes 1
Curated by ChEMBL
Assay Description
Inhibition of human recombinant DYRK1B expressed in Escherichia coli using GRSRSRSRSRSR as substrate
Eur J Med Chem 62: 728-37 (2013)
Article DOI: 10.1016/j.ejmech.2013.01.035
BindingDB Entry DOI: 10.7270/Q2T1553Q
Dual specificity tyrosine-phosphorylation-regulated kinase 1A
(Homo sapiens (Human))
BDBM50443640
(CHEMBL3092861)
Show SMILES NCCOCCOCCO
Show InChI InChI=1S/C6H15NO3/c7-1-3-9-5-6-10-4-2-8/h8H,1-7H2
Reactome pathway
n/an/a>1.00E+4n/an/an/an/an/an/a
Universit£ de Rennes 1
Curated by ChEMBL
Assay Description
Inhibition of human recombinant DYRK1A expressed in Escherichia coli using GRSRSRSRSRSR as substrate
Eur J Med Chem 62: 728-37 (2013)
Article DOI: 10.1016/j.ejmech.2013.01.035
BindingDB Entry DOI: 10.7270/Q2T1553Q
Cyclin-A2/Cyclin-dependent kinase 2
(Homo sapiens (Human))
BDBM50443640
(CHEMBL3092861)
Show SMILES NCCOCCOCCO
Show InChI InChI=1S/C6H15NO3/c7-1-3-9-5-6-10-4-2-8/h8H,1-7H2
NCI pathway
Reactome pathway
n/an/a>1.00E+4n/an/an/an/an/an/a
Universit£ de Rennes 1
Curated by ChEMBL
Assay Description
Inhibition of human recombinant CDK2/cyclin A using [gamma-33P]-ATP after 30 mins by scintillation counting
Eur J Med Chem 62: 728-37 (2013)
Article DOI: 10.1016/j.ejmech.2013.01.035
BindingDB Entry DOI: 10.7270/Q2T1553Q