BDBM50443775 CHEMBL3094105
SMILES: Nc1ccn([C@@H]2O[C@H](CNC(=O)c3cscn3)[C@@H](O)[C@H]2O)c(=O)n1
InChI Key: InChIKey=DMNKUXKUGQIELX-UGKPPGOTSA-N
Data: 1 Kd
Activity Spreadsheet -- Enzyme Inhibition Constant Data from BindingDB
Found 1 hit for monomerid = 50443775
Trg + Lig
Ki
nM
ΔG°
kcal/mole
IC50
nM
Kd
nM
EC50/IC50
nM
koff
s-1
kon
M-1s-1
pHTemp
°C
2-C-methyl-D-erythritol 2,4-cyclodiphosphate synthase
(Burkholderia pseudomallei (strain K96243))
BDBM50443775
(CHEMBL3094105)
Show SMILES Nc1ccn([C@@H]2O[C@H](CNC(=O)c3cscn3)[C@@H](O)[C@H]2O)c(=O)n1 |r|
Show InChI InChI=1S/C13H15N5O5S/c14-8-1-2-18(13(22)17-8)12-10(20)9(19)7(23-12)3-15-11(21)6-4-24-5-16-6/h1-2,4-5,7,9-10,12,19-20H,3H2,(H,15,21)(H2,14,17,22)/t7-,9-,10-,12-/m1/s1
n/an/an/a 2.00E+5n/an/an/an/an/a
Northern Illinois University
Curated by ChEMBL
Assay Description
Binding affinity to Burkolderia pseudomallei IspF by surface plasmon resonance method
Bioorg Med Chem Lett 23: 6860-3 (2013)
Article DOI: 10.1016/j.bmcl.2013.09.101
BindingDB Entry DOI: 10.7270/Q2NC62NX