BDBM50443845 CHEMBL3091528
SMILES: CCc1c(cccc1S(=O)(=O)N[C@@H](CNC(=O)c1ccc(Cl)s1)C(=O)N1CCOC[C@@H]1C)N1CCOCC1=O
InChI Key: InChIKey=BFXKZYUODLSNBX-WMZOPIPTSA-N
Data: 1 IC50
Activity Spreadsheet -- Enzyme Inhibition Constant Data from BindingDB
Found 1 hit for monomerid = 50443845
Trg + Lig
Ki
nM
ΔG°
kcal/mole
IC50
nM
Kd
nM
EC50/IC50
nM
koff
s-1
kon
M-1s-1
pHTemp
°C
Coagulation factor X
(Homo sapiens (Human))
BDBM50443845
(CHEMBL3091528)
Show SMILES CCc1c(cccc1S(=O)(=O)N[C@@H](CNC(=O)c1ccc(Cl)s1)C(=O)N1CCOC[C@@H]1C)N1CCOCC1=O |r|
Show InChI InChI=1S/C25H31ClN4O7S2/c1-3-17-19(30-10-12-37-15-23(30)31)5-4-6-21(17)39(34,35)28-18(25(33)29-9-11-36-14-16(29)2)13-27-24(32)20-7-8-22(26)38-20/h4-8,16,18,28H,3,9-15H2,1-2H3,(H,27,32)/t16-,18-/m0/s1
Reactome pathway
n/an/a 1.80n/an/an/an/an/an/a
Sanofi-Aventis R&D
Curated by ChEMBL
Assay Description
Inhibition of human coagulation factor 10a using S-2765 as substrate measured up to 20 mins by chromogenic assay
J Med Chem 56: 9441-56 (2014)
Article DOI: 10.1021/jm4005835
BindingDB Entry DOI: 10.7270/Q20K2B0C