BDBM50443846 CHEMBL3091527
SMILES: CCc1c(cccc1S(=O)(=O)N[C@@H](CNC(=O)c1ccc(Cl)s1)C(=O)N1CCOC[C@@H]1C)N1CCCC1=O
InChI Key: InChIKey=YJNVYIQRUCUHIU-WMZOPIPTSA-N
Data: 1 IC50
Activity Spreadsheet -- Enzyme Inhibition Constant Data from BindingDB
Found 1 hit for monomerid = 50443846
Trg + Lig
Ki
nM
ΔG°
kcal/mole
IC50
nM
Kd
nM
EC50/IC50
nM
koff
s-1
kon
M-1s-1
pHTemp
°C
Coagulation factor X
(Homo sapiens (Human))
BDBM50443846
(CHEMBL3091527)
Show SMILES CCc1c(cccc1S(=O)(=O)N[C@@H](CNC(=O)c1ccc(Cl)s1)C(=O)N1CCOC[C@@H]1C)N1CCCC1=O |r|
Show InChI InChI=1S/C25H31ClN4O6S2/c1-3-17-19(30-11-5-8-23(30)31)6-4-7-21(17)38(34,35)28-18(25(33)29-12-13-36-15-16(29)2)14-27-24(32)20-9-10-22(26)37-20/h4,6-7,9-10,16,18,28H,3,5,8,11-15H2,1-2H3,(H,27,32)/t16-,18-/m0/s1
Reactome pathway
n/an/a 0.5n/an/an/an/an/an/a
Sanofi-Aventis R&D
Curated by ChEMBL
Assay Description
Inhibition of human coagulation factor 10a using S-2765 as substrate measured up to 20 mins by chromogenic assay
J Med Chem 56: 9441-56 (2014)
Article DOI: 10.1021/jm4005835
BindingDB Entry DOI: 10.7270/Q20K2B0C