BDBM50443864 CHEMBL3091512
SMILES: CCc1c(cccc1S(=O)(=O)N[C@@H](CNC(=O)c1ccc(Cl)s1)C(=O)N1CCC(O)CC1)N1CCOCC1=O
InChI Key: InChIKey=IYGMCUZMVSMAMD-SFHVURJKSA-N
Data: 1 IC50
Activity Spreadsheet -- Enzyme Inhibition Constant Data from BindingDB
Found 1 hit for monomerid = 50443864
Trg + Lig
Ki
nM
ΔG°
kcal/mole
IC50
nM
Kd
nM
EC50/IC50
nM
koff
s-1
kon
M-1s-1
pHTemp
°C
Coagulation factor X
(Homo sapiens (Human))
BDBM50443864
(CHEMBL3091512)
Show SMILES CCc1c(cccc1S(=O)(=O)N[C@@H](CNC(=O)c1ccc(Cl)s1)C(=O)N1CCC(O)CC1)N1CCOCC1=O |r|
Show InChI InChI=1S/C25H31ClN4O7S2/c1-2-17-19(30-12-13-37-15-23(30)32)4-3-5-21(17)39(35,36)28-18(25(34)29-10-8-16(31)9-11-29)14-27-24(33)20-6-7-22(26)38-20/h3-7,16,18,28,31H,2,8-15H2,1H3,(H,27,33)/t18-/m0/s1
Reactome pathway
n/an/a 1.40n/an/an/an/an/an/a
Sanofi-Aventis R&D
Curated by ChEMBL
Assay Description
Inhibition of human coagulation factor 10a using S-2765 as substrate measured up to 20 mins by chromogenic assay
J Med Chem 56: 9441-56 (2014)
Article DOI: 10.1021/jm4005835
BindingDB Entry DOI: 10.7270/Q20K2B0C