null
SMILES: C[C@H]1COCCN1C(=O)[C@H](CNC(=O)c1ccc(Cl)s1)NS(=O)(=O)c1cccc(N2CCOCC2=O)c1C
InChI Key: InChIKey=CWTUIDUKGNNNBR-RDJZCZTQSA-N
Activity Spreadsheet -- Enzyme Inhibition Constant Data from BindingDB
Found 1 hit for monomerid = 50443866
Trg + Lig
Ki
nM
ΔG°
kcal/mole
IC50
nM
Kd
nM
EC50/IC50
nM
koff
s-1
kon
M-1s-1
pHTemp
°C
Coagulation factor X
(Homo sapiens (Human))
BDBM50443866
(CHEMBL3091510)
Show SMILES C[C@H]1COCCN1C(=O)[C@H](CNC(=O)c1ccc(Cl)s1)NS(=O)(=O)c1cccc(N2CCOCC2=O)c1C |r|
Show InChI InChI=1S/C24H29ClN4O7S2/c1-15-13-35-10-8-28(15)24(32)17(12-26-23(31)19-6-7-21(25)37-19)27-38(33,34)20-5-3-4-18(16(20)2)29-9-11-36-14-22(29)30/h3-7,15,17,27H,8-14H2,1-2H3,(H,26,31)/t15-,17-/m0/s1
Reactome pathway
n/an/a 1.90n/an/an/an/an/an/a
Sanofi-Aventis R&D
Curated by ChEMBL
Assay Description
Inhibition of human coagulation factor 10a using S-2765 as substrate measured up to 20 mins by chromogenic assay
J Med Chem 56: 9441-56 (2014)
Article DOI: 10.1021/jm4005835
BindingDB Entry DOI: 10.7270/Q20K2B0C