BDBM50444128 CHEMBL3093147
SMILES: CCCNc1ccc2oc(nc2c1)-c1cc(cnc1N)-c1cnn(c1)C1CCNCC1
InChI Key: InChIKey=QCQKRWMJIVIVGJ-UHFFFAOYSA-N
Data: 2 IC50
Activity Spreadsheet -- Enzyme Inhibition Constant Data from BindingDB
Found 2 hits for monomerid = 50444128
Trg + Lig
Ki
nM
ΔG°
kcal/mole
IC50
nM
Kd
nM
EC50/IC50
nM
koff
s-1
kon
M-1s-1
pHTemp
°C
Beta-adrenergic receptor kinase 1
(Homo sapiens (Human))
BDBM50444128
(CHEMBL3093147)
Show SMILES CCCNc1ccc2oc(nc2c1)-c1cc(cnc1N)-c1cnn(c1)C1CCNCC1
Show InChI InChI=1S/C23H27N7O/c1-2-7-26-17-3-4-21-20(11-17)29-23(31-21)19-10-15(12-27-22(19)24)16-13-28-30(14-16)18-5-8-25-9-6-18/h3-4,10-14,18,25-26H,2,5-9H2,1H3,(H2,24,27)
Reactome pathway
n/an/a 3.19E+3n/an/an/an/an/an/a
Korea Research Institute of Chemical Technology
Curated by ChEMBL
Assay Description
Inhibition of GRK-2 (unknown origin) preincubated with enzyme for 10 mins before adding peptide substrate and ATP measured after 1 hr by LANCE-TR-FRE...
Bioorg Med Chem Lett 23: 6711-6 (2013)
Article DOI: 10.1016/j.bmcl.2013.10.036
BindingDB Entry DOI: 10.7270/Q2SX6FPP
G protein-coupled receptor kinase 5
(Homo sapiens (Human))
BDBM50444128
(CHEMBL3093147)
Show SMILES CCCNc1ccc2oc(nc2c1)-c1cc(cnc1N)-c1cnn(c1)C1CCNCC1
Show InChI InChI=1S/C23H27N7O/c1-2-7-26-17-3-4-21-20(11-17)29-23(31-21)19-10-15(12-27-22(19)24)16-13-28-30(14-16)18-5-8-25-9-6-18/h3-4,10-14,18,25-26H,2,5-9H2,1H3,(H2,24,27)
NCI pathway
Reactome pathway
n/an/a 700n/an/an/an/an/an/a
Korea Research Institute of Chemical Technology
Curated by ChEMBL
Assay Description
Inhibition of GRK-5 (unknown origin) preincubated with enzyme for 10 mins before adding peptide substrate and ATP measured after 1 hr by LANCE-TR-FRE...
Bioorg Med Chem Lett 23: 6711-6 (2013)
Article DOI: 10.1016/j.bmcl.2013.10.036
BindingDB Entry DOI: 10.7270/Q2SX6FPP