BDBM50444175 CHEMBL3093420
SMILES: Clc1sc(NC(=O)N(CCC(c2ccccc2)c2ccccc2)CCN2CCOCC2)nc1-c1ccccc1
InChI Key: InChIKey=XOXXXJBSQAAXEN-UHFFFAOYSA-N
Data: 1 EC50
Activity Spreadsheet -- Enzyme Inhibition Constant Data from BindingDB
Found 1 hit for monomerid = 50444175
Trg + Lig
Ki
nM
ΔG°
kcal/mole
IC50
nM
Kd
nM
EC50/IC50
nM
koff
s-1
kon
M-1s-1
pHTemp
°C
Calcium-sensing receptor (CaSR)
(Homo sapiens (Human))
BDBM50444175
(CHEMBL3093420)
Show SMILES Clc1sc(NC(=O)N(CCC(c2ccccc2)c2ccccc2)CCN2CCOCC2)nc1-c1ccccc1
Show InChI InChI=1S/C31H33ClN4O2S/c32-29-28(26-14-8-3-9-15-26)33-30(39-29)34-31(37)36(19-18-35-20-22-38-23-21-35)17-16-27(24-10-4-1-5-11-24)25-12-6-2-7-13-25/h1-15,27H,16-23H2,(H,33,34,37)
n/an/an/an/a 18n/an/an/an/a
Amgen Inc.
Curated by ChEMBL
Assay Description
Activation of human CaSR
Bioorg Med Chem Lett 23: 6625-8 (2013)
Article DOI: 10.1016/j.bmcl.2013.10.050
BindingDB Entry DOI: 10.7270/Q2JD4Z7Z