BDBM50444188 CHEMBL3093456
SMILES: Cc1cc(C)c(c(C)c1)S(=O)(=O)NC(Cn1cc(C#N)c2ccccc12)C(F)(F)F
InChI Key: InChIKey=CPXLOFOGNURDFC-UHFFFAOYSA-N
Data: 4 IC50
Activity Spreadsheet -- Enzyme Inhibition Constant Data from BindingDB
Found 4 hits for monomerid = 50444188
Trg + Lig
Ki
nM
ΔG°
kcal/mole
IC50
nM
Kd
nM
EC50/IC50
nM
koff
s-1
kon
M-1s-1
pHTemp
°C
Glucocorticoid receptor
(Homo sapiens (Human))
BDBM50444188
(CHEMBL3093456)
Show SMILES Cc1cc(C)c(c(C)c1)S(=O)(=O)NC(Cn1cc(C#N)c2ccccc12)C(F)(F)F
Show InChI InChI=1S/C21H20F3N3O2S/c1-13-8-14(2)20(15(3)9-13)30(28,29)26-19(21(22,23)24)12-27-11-16(10-25)17-6-4-5-7-18(17)27/h4-9,11,19,26H,12H2,1-3H3
n/an/a>2.00E+3n/an/an/an/an/an/a
Boehringer Ingelheim Pharmaceuticals Inc.
Curated by ChEMBL
Assay Description
Agonist activity at glucocorticoid receptor in HFF assessed as inhibition of IL-1-induced IL-6 production after 24 hrs
Bioorg Med Chem Lett 23: 6640-4 (2013)
Article DOI: 10.1016/j.bmcl.2013.10.052
BindingDB Entry DOI: 10.7270/Q2DN46G5
Glucocorticoid receptor
(Homo sapiens (Human))
BDBM50444188
(CHEMBL3093456)
Show SMILES Cc1cc(C)c(c(C)c1)S(=O)(=O)NC(Cn1cc(C#N)c2ccccc12)C(F)(F)F
Show InChI InChI=1S/C21H20F3N3O2S/c1-13-8-14(2)20(15(3)9-13)30(28,29)26-19(21(22,23)24)12-27-11-16(10-25)17-6-4-5-7-18(17)27/h4-9,11,19,26H,12H2,1-3H3
n/an/a 15n/an/an/an/an/an/a
Boehringer Ingelheim Pharmaceuticals Inc.
Curated by ChEMBL
Assay Description
Displacement of TAMRA-labeled dexamethasone from glucocorticoid receptor (unknown origin) by fluorescence polarization competitive binding assay
Bioorg Med Chem Lett 23: 6640-4 (2013)
Article DOI: 10.1016/j.bmcl.2013.10.052
BindingDB Entry DOI: 10.7270/Q2DN46G5
Mineralocorticoid receptor
(Homo sapiens (Human))
BDBM50444188
(CHEMBL3093456)
Show SMILES Cc1cc(C)c(c(C)c1)S(=O)(=O)NC(Cn1cc(C#N)c2ccccc12)C(F)(F)F
Show InChI InChI=1S/C21H20F3N3O2S/c1-13-8-14(2)20(15(3)9-13)30(28,29)26-19(21(22,23)24)12-27-11-16(10-25)17-6-4-5-7-18(17)27/h4-9,11,19,26H,12H2,1-3H3
n/an/a 65n/an/an/an/an/an/a
Boehringer Ingelheim Pharmaceuticals Inc.
Curated by ChEMBL
Assay Description
Binding affinity to mineralocorticoid receptor (unknown origin) by fluorescence polarization competitive binding assay
Bioorg Med Chem Lett 23: 6640-4 (2013)
Article DOI: 10.1016/j.bmcl.2013.10.052
BindingDB Entry DOI: 10.7270/Q2DN46G5
Progesterone receptor
(Homo sapiens (Human))
BDBM50444188
(CHEMBL3093456)
Show SMILES Cc1cc(C)c(c(C)c1)S(=O)(=O)NC(Cn1cc(C#N)c2ccccc12)C(F)(F)F
Show InChI InChI=1S/C21H20F3N3O2S/c1-13-8-14(2)20(15(3)9-13)30(28,29)26-19(21(22,23)24)12-27-11-16(10-25)17-6-4-5-7-18(17)27/h4-9,11,19,26H,12H2,1-3H3
n/an/a 530n/an/an/an/an/an/a
Boehringer Ingelheim Pharmaceuticals Inc.
Curated by ChEMBL
Assay Description
Displacement of TAMRA-labeled mifepristone from progesterone receptor (unknown origin) by fluorescence polarization competitive binding assay
Bioorg Med Chem Lett 23: 6640-4 (2013)
Article DOI: 10.1016/j.bmcl.2013.10.052
BindingDB Entry DOI: 10.7270/Q2DN46G5