BDBM50444368 CHEMBL3094459
SMILES: COc1ncc2cc(C(=O)Nc3cc(ccc3Cl)C(=O)NC(CCN)C3CCCCC3)c(=O)[nH]c2n1
InChI Key: InChIKey=QSWUXXLUPIYCHQ-UHFFFAOYSA-N
Data: 2 IC50
Activity Spreadsheet -- Enzyme Inhibition Constant Data from BindingDB
Found 2 hits for monomerid = 50444368
Trg + Lig
Ki
nM
ΔG°
kcal/mole
IC50
nM
Kd
nM
EC50/IC50
nM
koff
s-1
kon
M-1s-1
pHTemp
°C
Dual-specificity tyrosine-regulated kinases 1B
(Homo sapiens (Human))
BDBM50444368
(CHEMBL3094459)
Show SMILES COc1ncc2cc(C(=O)Nc3cc(ccc3Cl)C(=O)NC(CCN)C3CCCCC3)c(=O)[nH]c2n1
Show InChI InChI=1S/C25H29ClN6O4/c1-36-25-28-13-16-11-17(24(35)31-21(16)32-25)23(34)30-20-12-15(7-8-18(20)26)22(33)29-19(9-10-27)14-5-3-2-4-6-14/h7-8,11-14,19H,2-6,9-10,27H2,1H3,(H,29,33)(H,30,34)(H,28,31,32,35)
n/an/a 615n/an/an/an/an/an/a
Hoffmann-La Roche Inc.
Curated by ChEMBL
Assay Description
Inhibition of DYRK1B (unknown origin)
Bioorg Med Chem Lett 23: 6610-5 (2013)
Article DOI: 10.1016/j.bmcl.2013.10.055
BindingDB Entry DOI: 10.7270/Q20G3MNJ
Dual-specificity tyrosine-phosphorylation regulated kinase 1A
(Homo sapiens (Human))
BDBM50444368
(CHEMBL3094459)
Show SMILES COc1ncc2cc(C(=O)Nc3cc(ccc3Cl)C(=O)NC(CCN)C3CCCCC3)c(=O)[nH]c2n1
Show InChI InChI=1S/C25H29ClN6O4/c1-36-25-28-13-16-11-17(24(35)31-21(16)32-25)23(34)30-20-12-15(7-8-18(20)26)22(33)29-19(9-10-27)14-5-3-2-4-6-14/h7-8,11-14,19H,2-6,9-10,27H2,1H3,(H,29,33)(H,30,34)(H,28,31,32,35)
Reactome pathway
n/an/a 301n/an/an/an/an/an/a
Hoffmann-La Roche Inc.
Curated by ChEMBL
Assay Description
Inhibition of DYRK1A (unknown origin)
Bioorg Med Chem Lett 23: 6610-5 (2013)
Article DOI: 10.1016/j.bmcl.2013.10.055
BindingDB Entry DOI: 10.7270/Q20G3MNJ