BDBM50444382 CHEMBL3094445
SMILES: CNC(=O)c1ccc(Cl)c(NC(=O)c2cc3cnc(OC)nc3[nH]c2=O)c1
InChI Key: InChIKey=CXOICQRVGSVVHC-UHFFFAOYSA-N
Data: 2 IC50
Activity Spreadsheet -- Enzyme Inhibition Constant Data from BindingDB
Found 2 hits for monomerid = 50444382
Trg + Lig
Ki
nM
ΔG°
kcal/mole
IC50
nM
Kd
nM
EC50/IC50
nM
koff
s-1
kon
M-1s-1
pHTemp
°C
Dual-specificity tyrosine-regulated kinases 1B
(Homo sapiens (Human))
BDBM50444382
(CHEMBL3094445)
Show SMILES CNC(=O)c1ccc(Cl)c(NC(=O)c2cc3cnc(OC)nc3[nH]c2=O)c1
Show InChI InChI=1S/C17H14ClN5O4/c1-19-14(24)8-3-4-11(18)12(6-8)21-15(25)10-5-9-7-20-17(27-2)23-13(9)22-16(10)26/h3-7H,1-2H3,(H,19,24)(H,21,25)(H,20,22,23,26)
n/an/a 248n/an/an/an/an/an/a
Hoffmann-La Roche Inc.
Curated by ChEMBL
Assay Description
Inhibition of DYRK1B (unknown origin)
Bioorg Med Chem Lett 23: 6610-5 (2013)
Article DOI: 10.1016/j.bmcl.2013.10.055
BindingDB Entry DOI: 10.7270/Q20G3MNJ
Dual-specificity tyrosine-phosphorylation regulated kinase 1A
(Homo sapiens (Human))
BDBM50444382
(CHEMBL3094445)
Show SMILES CNC(=O)c1ccc(Cl)c(NC(=O)c2cc3cnc(OC)nc3[nH]c2=O)c1
Show InChI InChI=1S/C17H14ClN5O4/c1-19-14(24)8-3-4-11(18)12(6-8)21-15(25)10-5-9-7-20-17(27-2)23-13(9)22-16(10)26/h3-7H,1-2H3,(H,19,24)(H,21,25)(H,20,22,23,26)
Reactome pathway
n/an/a 107n/an/an/an/an/an/a
Hoffmann-La Roche Inc.
Curated by ChEMBL
Assay Description
Inhibition of DYRK1A (unknown origin)
Bioorg Med Chem Lett 23: 6610-5 (2013)
Article DOI: 10.1016/j.bmcl.2013.10.055
BindingDB Entry DOI: 10.7270/Q20G3MNJ