BDBM50444514 CHEMBL3092843
SMILES: CCOC(=O)\C=C\CC[C@H](NC(=O)OCc1ccccc1)C(=O)N[C@@H](CCC(N)=O)C(=O)N1CCC[C@H]1C(=O)N[C@@H](CC(C)C)C(=O)OC
InChI Key: InChIKey=NMBWGLSRJFOPPP-UJFCFYEWSA-N
Data: 3 IC50
Activity Spreadsheet -- Enzyme Inhibition Constant Data from BindingDB
Found 3 hits for monomerid = 50444514
Trg + Lig
Ki
nM
ΔG°
kcal/mole
IC50
nM
Kd
nM
EC50/IC50
nM
koff
s-1
kon
M-1s-1
pHTemp
°C
Coagulation factor XIII A chain
(Homo sapiens (Human))
BDBM50444514
(CHEMBL3092843)
Show SMILES CCOC(=O)\C=C\CC[C@H](NC(=O)OCc1ccccc1)C(=O)N[C@@H](CCC(N)=O)C(=O)N1CCC[C@H]1C(=O)N[C@@H](CC(C)C)C(=O)OC |r|
Show InChI InChI=1S/C34H49N5O10/c1-5-48-29(41)16-10-9-14-24(38-34(46)49-21-23-12-7-6-8-13-23)30(42)36-25(17-18-28(35)40)32(44)39-19-11-15-27(39)31(43)37-26(20-22(2)3)33(45)47-4/h6-8,10,12-13,16,22,24-27H,5,9,11,14-15,17-21H2,1-4H3,(H2,35,40)(H,36,42)(H,37,43)(H,38,46)/b16-10+/t24-,25-,26-,27-/m0/s1
Reactome pathway
n/an/a>5.00E+4n/an/an/an/an/an/a
TBA
Curated by ChEMBL
Assay Description
Inhibition of factor13a (unknown origin)
Bioorg Med Chem Lett 23: 6528-43 (2014)
BindingDB Entry DOI: 10.7270/Q2K64KJP
Protein-glutamine gamma-glutamyltransferase 2
(Homo sapiens (Human))
BDBM50444514
(CHEMBL3092843)
Show SMILES CCOC(=O)\C=C\CC[C@H](NC(=O)OCc1ccccc1)C(=O)N[C@@H](CCC(N)=O)C(=O)N1CCC[C@H]1C(=O)N[C@@H](CC(C)C)C(=O)OC |r|
Show InChI InChI=1S/C34H49N5O10/c1-5-48-29(41)16-10-9-14-24(38-34(46)49-21-23-12-7-6-8-13-23)30(42)36-25(17-18-28(35)40)32(44)39-19-11-15-27(39)31(43)37-26(20-22(2)3)33(45)47-4/h6-8,10,12-13,16,22,24-27H,5,9,11,14-15,17-21H2,1-4H3,(H2,35,40)(H,36,42)(H,37,43)(H,38,46)/b16-10+/t24-,25-,26-,27-/m0/s1
n/an/a 20n/an/an/an/an/an/a
Daegu-Gyeongbuk Medical Innovation Foundation (DGMIF)
Curated by ChEMBL
Assay Description
Inhibition of human TG2 using glycine methyl ester/Abz-APE as substrate after 5 mins
J Med Chem 60: 554-567 (2017)
Article DOI: 10.1021/acs.jmedchem.6b01036
BindingDB Entry DOI: 10.7270/Q2F47RKD
Protein-glutamine gamma-glutamyltransferase 2
(Homo sapiens (Human))
BDBM50444514
(CHEMBL3092843)
Show SMILES CCOC(=O)\C=C\CC[C@H](NC(=O)OCc1ccccc1)C(=O)N[C@@H](CCC(N)=O)C(=O)N1CCC[C@H]1C(=O)N[C@@H](CC(C)C)C(=O)OC |r|
Show InChI InChI=1S/C34H49N5O10/c1-5-48-29(41)16-10-9-14-24(38-34(46)49-21-23-12-7-6-8-13-23)30(42)36-25(17-18-28(35)40)32(44)39-19-11-15-27(39)31(43)37-26(20-22(2)3)33(45)47-4/h6-8,10,12-13,16,22,24-27H,5,9,11,14-15,17-21H2,1-4H3,(H2,35,40)(H,36,42)(H,37,43)(H,38,46)/b16-10+/t24-,25-,26-,27-/m0/s1
n/an/a 20n/an/an/an/an/an/a
TBA
Curated by ChEMBL
Assay Description
Inhibition of human TGase2
Bioorg Med Chem Lett 23: 6528-43 (2014)
BindingDB Entry DOI: 10.7270/Q2K64KJP