BDBM50444572 CHEMBL3099707
SMILES: c1nnc([nH]1)-c1ccccn1
InChI Key: InChIKey=PVMLJDLTWMGZAH-UHFFFAOYSA-N
Data: 1 IC50
Activity Spreadsheet -- Enzyme Inhibition Constant Data from BindingDB
Found 1 hit for monomerid = 50444572
Trg + Lig
Ki
nM
ΔG°
kcal/mole
IC50
nM
Kd
nM
EC50/IC50
nM
koff
s-1
kon
M-1s-1
pHTemp
°C
DNA ligase
(Staphylococcus aureus)
BDBM50444572
(CHEMBL3099707)
Show SMILES c1nnc([nH]1)-c1ccccn1
Show InChI InChI=1S/C7H6N4/c1-2-4-8-6(3-1)7-9-5-10-11-7/h1-5H,(H,9,10,11)
n/an/a 3.00E+5n/an/an/an/an/an/a
Astex Pharmaceuticals Inc.
Curated by ChEMBL
Assay Description
Inhibition of C-terminal 6xHis-tagged full length recombinant Staphylococcus aureus DNA ligase (1 to 312) expressed in Escherichia coli BL21 (DE3) us...
ACS Med Chem Lett 4: 1208-12 (2013)
Article DOI: 10.1021/ml4003277
BindingDB Entry DOI: 10.7270/Q2J967V2