BDBM50444574 CHEMBL3099708
SMILES: COc1cccc(n1)-c1nnc[nH]1
InChI Key: InChIKey=DFNBNJOYOBIGOY-UHFFFAOYSA-N
Data: 1 IC50
Activity Spreadsheet -- Enzyme Inhibition Constant Data from BindingDB
Found 1 hit for monomerid = 50444574
Trg + Lig
Ki
nM
ΔG°
kcal/mole
IC50
nM
Kd
nM
EC50/IC50
nM
koff
s-1
kon
M-1s-1
pHTemp
°C
DNA ligase
(Staphylococcus aureus)
BDBM50444574
(CHEMBL3099708)
Show SMILES COc1cccc(n1)-c1nnc[nH]1
Show InChI InChI=1S/C8H8N4O/c1-13-7-4-2-3-6(11-7)8-9-5-10-12-8/h2-5H,1H3,(H,9,10,12)
n/an/a 1.30E+5n/an/an/an/an/an/a
Astex Pharmaceuticals Inc.
Curated by ChEMBL
Assay Description
Inhibition of C-terminal 6xHis-tagged full length recombinant Staphylococcus aureus DNA ligase (1 to 312) expressed in Escherichia coli BL21 (DE3) us...
ACS Med Chem Lett 4: 1208-12 (2013)
Article DOI: 10.1021/ml4003277
BindingDB Entry DOI: 10.7270/Q2J967V2