BDBM50444901 CHEMBL3099638
SMILES: CC(C)(c1ccc(OCCN2CCCCCC2)cc1)c1ccc(OCCN2CCCCCC2)cc1
InChI Key: InChIKey=FTDOJEVPLASPGG-UHFFFAOYSA-N
Data: 3 IC50
Activity Spreadsheet -- Enzyme Inhibition Constant Data from BindingDB
Found 3 hits for monomerid = 50444901
Trg + Lig
Ki
nM
ΔG°
kcal/mole
IC50
nM
Kd
nM
EC50/IC50
nM
koff
s-1
kon
M-1s-1
pHTemp
°C
Proteasome Macropain subunit
(Homo sapiens (Human))
BDBM50444901
(CHEMBL3099638)
Show SMILES CC(C)(c1ccc(OCCN2CCCCCC2)cc1)c1ccc(OCCN2CCCCCC2)cc1
Show InChI InChI=1S/C31H46N2O2/c1-31(2,27-11-15-29(16-12-27)34-25-23-32-19-7-3-4-8-20-32)28-13-17-30(18-14-28)35-26-24-33-21-9-5-6-10-22-33/h11-18H,3-10,19-26H2,1-2H3
Reactome pathway
n/an/a 1.87E+3n/an/an/an/an/an/a
Institute of Bio-Science and Technology
Curated by ChEMBL
Assay Description
Inhibition of trypsin-like activity of human 20S proteasome beta 2 subunit assessed as hydrolysis of Boc-LRR-AMC fluorogenic substrate measured for 1...
Eur J Med Chem 71: 290-305 (2014)
Article DOI: 10.1016/j.ejmech.2013.11.009
BindingDB Entry DOI: 10.7270/Q2222W81
20S proteasome chymotrypsin-like
(Homo sapiens (Human))
BDBM50444901
(CHEMBL3099638)
Show SMILES CC(C)(c1ccc(OCCN2CCCCCC2)cc1)c1ccc(OCCN2CCCCCC2)cc1
Show InChI InChI=1S/C31H46N2O2/c1-31(2,27-11-15-29(16-12-27)34-25-23-32-19-7-3-4-8-20-32)28-13-17-30(18-14-28)35-26-24-33-21-9-5-6-10-22-33/h11-18H,3-10,19-26H2,1-2H3
Reactome pathway
n/an/a 750n/an/an/an/an/an/a
Institute of Bio-Science and Technology
Curated by ChEMBL
Assay Description
Inhibition of chymotrypsin-like activity of human 20S proteasome beta 5 subunit assessed as hydrolysis of succinyl-LLVY-AMC fluorogenic substrate mea...
Eur J Med Chem 71: 290-305 (2014)
Article DOI: 10.1016/j.ejmech.2013.11.009
BindingDB Entry DOI: 10.7270/Q2222W81
Proteasome component C5
(Homo sapiens (Human))
BDBM50444901
(CHEMBL3099638)
Show SMILES CC(C)(c1ccc(OCCN2CCCCCC2)cc1)c1ccc(OCCN2CCCCCC2)cc1
Show InChI InChI=1S/C31H46N2O2/c1-31(2,27-11-15-29(16-12-27)34-25-23-32-19-7-3-4-8-20-32)28-13-17-30(18-14-28)35-26-24-33-21-9-5-6-10-22-33/h11-18H,3-10,19-26H2,1-2H3
Reactome pathway
n/an/a 770n/an/an/an/an/an/a
Institute of Bio-Science and Technology
Curated by ChEMBL
Assay Description
Inhibition of PGPH-like activity of human 20S proteasome beta 1 subunit assessed as hydrolysis of Z-LLE-AMC fluorogenic substrate measured for 1 hr b...
Eur J Med Chem 71: 290-305 (2014)
Article DOI: 10.1016/j.ejmech.2013.11.009
BindingDB Entry DOI: 10.7270/Q2222W81