BDBM50444903 CHEMBL3099631
SMILES: [#6]-[#6]\[#6](-[#6]-[#6])=[#6](\c1ccc(-[#8]-[#6]-[#6]-[#7]-2-[#6]-[#6]-[#6]-[#6]-[#6]-[#6]-2)cc1)-c1ccc(-[#8]-[#6]-[#6]-[#7]-2-[#6]-[#6]-[#6]-[#6]-[#6]-[#6]-2)cc1
InChI Key: InChIKey=BMTQBVWFOFKLIN-UHFFFAOYSA-N
Data: 3 IC50
Activity Spreadsheet -- Enzyme Inhibition Constant Data from BindingDB
Found 3 hits for monomerid = 50444903
Trg + Lig
Ki
nM
ΔG°
kcal/mole
IC50
nM
Kd
nM
EC50/IC50
nM
koff
s-1
kon
M-1s-1
pHTemp
°C
20S proteasome chymotrypsin-like
(Homo sapiens (Human))
BDBM50444903
(CHEMBL3099631)
Show SMILES [#6]-[#6]\[#6](-[#6]-[#6])=[#6](\c1ccc(-[#8]-[#6]-[#6]-[#7]-2-[#6]-[#6]-[#6]-[#6]-[#6]-[#6]-2)cc1)-c1ccc(-[#8]-[#6]-[#6]-[#7]-2-[#6]-[#6]-[#6]-[#6]-[#6]-[#6]-2)cc1
Show InChI InChI=1S/C34H50N2O2/c1-3-29(4-2)34(30-13-17-32(18-14-30)37-27-25-35-21-9-5-6-10-22-35)31-15-19-33(20-16-31)38-28-26-36-23-11-7-8-12-24-36/h13-20H,3-12,21-28H2,1-2H3
Reactome pathway
n/an/a 1.57E+3n/an/an/an/an/an/a
Institute of Bio-Science and Technology
Curated by ChEMBL
Assay Description
Inhibition of chymotrypsin-like activity of human 20S proteasome beta 5 subunit assessed as hydrolysis of succinyl-LLVY-AMC fluorogenic substrate mea...
Eur J Med Chem 71: 290-305 (2014)
Article DOI: 10.1016/j.ejmech.2013.11.009
BindingDB Entry DOI: 10.7270/Q2222W81
Proteasome component C5
(Homo sapiens (Human))
BDBM50444903
(CHEMBL3099631)
Show SMILES [#6]-[#6]\[#6](-[#6]-[#6])=[#6](\c1ccc(-[#8]-[#6]-[#6]-[#7]-2-[#6]-[#6]-[#6]-[#6]-[#6]-[#6]-2)cc1)-c1ccc(-[#8]-[#6]-[#6]-[#7]-2-[#6]-[#6]-[#6]-[#6]-[#6]-[#6]-2)cc1
Show InChI InChI=1S/C34H50N2O2/c1-3-29(4-2)34(30-13-17-32(18-14-30)37-27-25-35-21-9-5-6-10-22-35)31-15-19-33(20-16-31)38-28-26-36-23-11-7-8-12-24-36/h13-20H,3-12,21-28H2,1-2H3
Reactome pathway
n/an/a 840n/an/an/an/an/an/a
Institute of Bio-Science and Technology
Curated by ChEMBL
Assay Description
Inhibition of PGPH-like activity of human 20S proteasome beta 1 subunit assessed as hydrolysis of Z-LLE-AMC fluorogenic substrate measured for 1 hr b...
Eur J Med Chem 71: 290-305 (2014)
Article DOI: 10.1016/j.ejmech.2013.11.009
BindingDB Entry DOI: 10.7270/Q2222W81
Proteasome Macropain subunit
(Homo sapiens (Human))
BDBM50444903
(CHEMBL3099631)
Show SMILES [#6]-[#6]\[#6](-[#6]-[#6])=[#6](\c1ccc(-[#8]-[#6]-[#6]-[#7]-2-[#6]-[#6]-[#6]-[#6]-[#6]-[#6]-2)cc1)-c1ccc(-[#8]-[#6]-[#6]-[#7]-2-[#6]-[#6]-[#6]-[#6]-[#6]-[#6]-2)cc1
Show InChI InChI=1S/C34H50N2O2/c1-3-29(4-2)34(30-13-17-32(18-14-30)37-27-25-35-21-9-5-6-10-22-35)31-15-19-33(20-16-31)38-28-26-36-23-11-7-8-12-24-36/h13-20H,3-12,21-28H2,1-2H3
Reactome pathway
n/an/a 960n/an/an/an/an/an/a
Institute of Bio-Science and Technology
Curated by ChEMBL
Assay Description
Inhibition of trypsin-like activity of human 20S proteasome beta 2 subunit assessed as hydrolysis of Boc-LRR-AMC fluorogenic substrate measured for 1...
Eur J Med Chem 71: 290-305 (2014)
Article DOI: 10.1016/j.ejmech.2013.11.009
BindingDB Entry DOI: 10.7270/Q2222W81