BDBM50444923 CHEMBL3099748
SMILES: C[C@H](Cc1ccc(O)cc1)NC(=O)c1cc(C(O)=O)c2cc(ccc2n1)-c1cccc(c1)C(F)(F)F
InChI Key: InChIKey=PUFQAOUEGKPRGD-OAHLLOKOSA-N
Data: 1 KI  1 IC50  1 Kd
Activity Spreadsheet -- Enzyme Inhibition Constant Data from BindingDB
Found 3 hits for monomerid = 50444923
Trg + Lig
Ki
nM
ΔG°
kcal/mole
IC50
nM
Kd
nM
EC50/IC50
nM
koff
s-1
kon
M-1s-1
pHTemp
°C
Cyclin-dependent kinase 2
(Homo sapiens (Human))
BDBM50444923
(CHEMBL3099748)
Show SMILES C[C@H](Cc1ccc(O)cc1)NC(=O)c1cc(C(O)=O)c2cc(ccc2n1)-c1cccc(c1)C(F)(F)F |r|
Show InChI InChI=1S/C27H21F3N2O4/c1-15(11-16-5-8-20(33)9-6-16)31-25(34)24-14-22(26(35)36)21-13-18(7-10-23(21)32-24)17-3-2-4-19(12-17)27(28,29)30/h2-10,12-15,33H,11H2,1H3,(H,31,34)(H,35,36)/t15-/m1/s1
NCI pathway
Reactome pathway
2.50E+3n/an/an/an/an/an/an/an/a
Merck Research Laboratories
Curated by ChEMBL
Assay Description
Displacement of B-Alexa-Fluor647 from CDK2 (unknown origin) by fluorescence polarization assay
Bioorg Med Chem Lett 24: 199-203 (2013)
Article DOI: 10.1016/j.bmcl.2013.11.041
BindingDB Entry DOI: 10.7270/Q2SN0BF8
Cyclin-dependent kinase 2
(Homo sapiens (Human))
BDBM50444923
(CHEMBL3099748)
Show SMILES C[C@H](Cc1ccc(O)cc1)NC(=O)c1cc(C(O)=O)c2cc(ccc2n1)-c1cccc(c1)C(F)(F)F |r|
Show InChI InChI=1S/C27H21F3N2O4/c1-15(11-16-5-8-20(33)9-6-16)31-25(34)24-14-22(26(35)36)21-13-18(7-10-23(21)32-24)17-3-2-4-19(12-17)27(28,29)30/h2-10,12-15,33H,11H2,1H3,(H,31,34)(H,35,36)/t15-/m1/s1
NCI pathway
Reactome pathway
n/an/an/a 4.00E+3n/an/an/an/an/a
Merck Research Laboratories
Curated by ChEMBL
Assay Description
Binding affinity to CDK2 (unknown origin) at 20 to 80 degC by circular dichroism analysis
Bioorg Med Chem Lett 24: 199-203 (2013)
Article DOI: 10.1016/j.bmcl.2013.11.041
BindingDB Entry DOI: 10.7270/Q2SN0BF8
Cyclin-dependent kinase 2
(Homo sapiens (Human))
BDBM50444923
(CHEMBL3099748)
Show SMILES C[C@H](Cc1ccc(O)cc1)NC(=O)c1cc(C(O)=O)c2cc(ccc2n1)-c1cccc(c1)C(F)(F)F |r|
Show InChI InChI=1S/C27H21F3N2O4/c1-15(11-16-5-8-20(33)9-6-16)31-25(34)24-14-22(26(35)36)21-13-18(7-10-23(21)32-24)17-3-2-4-19(12-17)27(28,29)30/h2-10,12-15,33H,11H2,1H3,(H,31,34)(H,35,36)/t15-/m1/s1
NCI pathway
Reactome pathway
n/an/a>1.00E+4n/an/an/an/an/a25
Merck Research Laboratories
Curated by ChEMBL
Assay Description
Inhibition of CDK2 (unknown origin)-cyclin A interaction preincubated for 30 mins at room temperature followed by incubation at 40 degC for 30 mins b...
Bioorg Med Chem Lett 24: 199-203 (2013)
Article DOI: 10.1016/j.bmcl.2013.11.041
BindingDB Entry DOI: 10.7270/Q2SN0BF8