null
SMILES: COC(=O)[C@H](Cc1ccc(O)cc1)NC(=O)c1cc(C(O)=O)c2cc(ccc2n1)N1CCOCC1
InChI Key: InChIKey=IYNYMBFCHOYHTL-QFIPXVFZSA-N
Activity Spreadsheet -- Enzyme Inhibition Constant Data from BindingDB
Found 3 hits for monomerid = 50444936
Trg + Lig
Ki
nM
ΔG°
kcal/mole
IC50
nM
Kd
nM
EC50/IC50
nM
koff
s-1
kon
M-1s-1
pHTemp
°C
Cyclin-dependent kinase 2
(Homo sapiens (Human))
BDBM50444936
(CHEMBL3099760)
Show SMILES COC(=O)[C@H](Cc1ccc(O)cc1)NC(=O)c1cc(C(O)=O)c2cc(ccc2n1)N1CCOCC1 |r|
Show InChI InChI=1S/C25H25N3O7/c1-34-25(33)22(12-15-2-5-17(29)6-3-15)27-23(30)21-14-19(24(31)32)18-13-16(4-7-20(18)26-21)28-8-10-35-11-9-28/h2-7,13-14,22,29H,8-12H2,1H3,(H,27,30)(H,31,32)/t22-/m0/s1
NCI pathway
Reactome pathway
2.80E+3n/an/an/an/an/an/an/an/a
Merck Research Laboratories
Curated by ChEMBL
Assay Description
Displacement of B-Alexa-Fluor647 from CDK2 (unknown origin) by fluorescence polarization assay
Bioorg Med Chem Lett 24: 199-203 (2013)
Article DOI: 10.1016/j.bmcl.2013.11.041
BindingDB Entry DOI: 10.7270/Q2SN0BF8
Cyclin-dependent kinase 2
(Homo sapiens (Human))
BDBM50444936
(CHEMBL3099760)
Show SMILES COC(=O)[C@H](Cc1ccc(O)cc1)NC(=O)c1cc(C(O)=O)c2cc(ccc2n1)N1CCOCC1 |r|
Show InChI InChI=1S/C25H25N3O7/c1-34-25(33)22(12-15-2-5-17(29)6-3-15)27-23(30)21-14-19(24(31)32)18-13-16(4-7-20(18)26-21)28-8-10-35-11-9-28/h2-7,13-14,22,29H,8-12H2,1H3,(H,27,30)(H,31,32)/t22-/m0/s1
NCI pathway
Reactome pathway
n/an/an/a 2.40E+3n/an/an/an/an/a
Merck Research Laboratories
Curated by ChEMBL
Assay Description
Binding affinity to CDK2 (unknown origin) at 20 to 80 degC by circular dichroism analysis
Bioorg Med Chem Lett 24: 199-203 (2013)
Article DOI: 10.1016/j.bmcl.2013.11.041
BindingDB Entry DOI: 10.7270/Q2SN0BF8
Cyclin-dependent kinase 2
(Homo sapiens (Human))
BDBM50444936
(CHEMBL3099760)
Show SMILES COC(=O)[C@H](Cc1ccc(O)cc1)NC(=O)c1cc(C(O)=O)c2cc(ccc2n1)N1CCOCC1 |r|
Show InChI InChI=1S/C25H25N3O7/c1-34-25(33)22(12-15-2-5-17(29)6-3-15)27-23(30)21-14-19(24(31)32)18-13-16(4-7-20(18)26-21)28-8-10-35-11-9-28/h2-7,13-14,22,29H,8-12H2,1H3,(H,27,30)(H,31,32)/t22-/m0/s1
NCI pathway
Reactome pathway
n/an/a>1.00E+4n/an/an/an/an/a25
Merck Research Laboratories
Curated by ChEMBL
Assay Description
Inhibition of CDK2 (unknown origin)-cyclin A interaction preincubated for 30 mins at room temperature followed by incubation at 40 degC for 30 mins b...
Bioorg Med Chem Lett 24: 199-203 (2013)
Article DOI: 10.1016/j.bmcl.2013.11.041
BindingDB Entry DOI: 10.7270/Q2SN0BF8