BDBM50445358 CHEMBL3104258
SMILES: CC(=NNC(=O)c1cnc(Cl)c(Br)c1)c1cc(Cl)ccc1O
InChI Key: InChIKey=MRKSYAHICZALKL-UHFFFAOYSA-N
Data: 1 IC50
Activity Spreadsheet -- Enzyme Inhibition Constant Data from BindingDB
Found 1 hit for monomerid = 50445358
Trg + Lig
Ki
nM
ΔG°
kcal/mole
IC50
nM
Kd
nM
EC50/IC50
nM
koff
s-1
kon
M-1s-1
pHTemp
°C
Lysine-specific histone demethylase 1A
(Homo sapiens (Human))
BDBM50445358
(CHEMBL3104258)
Show SMILES CC(=NNC(=O)c1cnc(Cl)c(Br)c1)c1cc(Cl)ccc1O |w:2.2|
Show InChI InChI=1S/C14H10BrCl2N3O2/c1-7(10-5-9(16)2-3-12(10)21)19-20-14(22)8-4-11(15)13(17)18-6-8/h2-6,21H,1H3,(H,20,22)
Reactome pathway
n/an/a>3.00E+3n/an/an/an/an/an/a
University of Utah
Curated by ChEMBL
Assay Description
Inhibition of LSD1 (unknown origin) using dimethyl K4 peptide as substrate assessed as resorufin level by spectrophotometric analysis
J Med Chem 56: 9496-508 (2014)
Article DOI: 10.1021/jm400870h
BindingDB Entry DOI: 10.7270/Q2Z60QJ7