BDBM50445365 CHEMBL3104344
SMILES: CCNCCCNC\C=C/CNCCCNCC
InChI Key: InChIKey=XFWLTFZLLXVKDY-WAYWQWQTSA-N
Data: 1 IC50
Activity Spreadsheet -- Enzyme Inhibition Constant Data from BindingDB
Found 1 hit for monomerid = 50445365
Trg + Lig
Ki
nM
ΔG°
kcal/mole
IC50
nM
Kd
nM
EC50/IC50
nM
koff
s-1
kon
M-1s-1
pHTemp
°C
Lysine-specific histone demethylase 1A
(Homo sapiens (Human))
BDBM50445365
(CHEMBL3104344)
Show SMILES CCNCCCNC\C=C/CNCCCNCC
Show InChI InChI=1S/C14H32N4/c1-3-15-11-7-13-17-9-5-6-10-18-14-8-12-16-4-2/h5-6,15-18H,3-4,7-14H2,1-2H3/b6-5-
Reactome pathway
n/an/a 250n/an/an/an/an/an/a
University of Utah
Curated by ChEMBL
Assay Description
Inhibition of human recombinant LSD1 expressed in Escherichia coli BL21(DE3) using H3K4me2 as substrate by chemiluminescence assay
J Med Chem 56: 9496-508 (2014)
Article DOI: 10.1021/jm400870h
BindingDB Entry DOI: 10.7270/Q2Z60QJ7