BDBM50445769 CHEMBL3104615
SMILES: Fc1cccc(F)c1C(=O)N1CCC2(CCCN(C2)C(=O)Nc2ccc(OC(F)(F)F)cc2)CC1
InChI Key: InChIKey=WBOMGSWMSQYJSL-UHFFFAOYSA-N
Data: 2 IC50
Activity Spreadsheet -- Enzyme Inhibition Constant Data from BindingDB
Found 2 hits for monomerid = 50445769
Trg + Lig
Ki
nM
ΔG°
kcal/mole
IC50
nM
Kd
nM
EC50/IC50
nM
koff
s-1
kon
M-1s-1
pHTemp
°C
EBifunctional epoxide hydrolase 2
(Homo sapiens (Human))
BDBM50445769
(CHEMBL3104615)
Show SMILES Fc1cccc(F)c1C(=O)N1CCC2(CCCN(C2)C(=O)Nc2ccc(OC(F)(F)F)cc2)CC1
Show InChI InChI=1S/C24H24F5N3O3/c25-18-3-1-4-19(26)20(18)21(33)31-13-10-23(11-14-31)9-2-12-32(15-23)22(34)30-16-5-7-17(8-6-16)35-24(27,28)29/h1,3-8H,2,9-15H2,(H,30,34)
n/an/a 0.125n/an/an/an/an/an/a
Toray Industries, Inc.
Curated by ChEMBL
Assay Description
Inhibition of human recombinant sEH expressed in baculovirus infected insect Sf9 cells using cyano(6-methoxynaphthalen-2-yl)methyl trans-[(3-phenylox...
Bioorg Med Chem Lett 24: 565-70 (2014)
Article DOI: 10.1016/j.bmcl.2013.12.020
BindingDB Entry DOI: 10.7270/Q2V69M26
Epoxide hydrolase 2
(Rattus norvegicus)
BDBM50445769
(CHEMBL3104615)
Show SMILES Fc1cccc(F)c1C(=O)N1CCC2(CCCN(C2)C(=O)Nc2ccc(OC(F)(F)F)cc2)CC1
Show InChI InChI=1S/C24H24F5N3O3/c25-18-3-1-4-19(26)20(18)21(33)31-13-10-23(11-14-31)9-2-12-32(15-23)22(34)30-16-5-7-17(8-6-16)35-24(27,28)29/h1,3-8H,2,9-15H2,(H,30,34)
n/an/a 3.30n/an/an/an/an/an/a
Toray Industries, Inc.
Curated by ChEMBL
Assay Description
Inhibition of rat recombinant sEH expressed in baculovirus infected insect Sf9 cells using cyano(6-methoxynaphthalen-2-yl)methyl trans-[(3-phenyloxir...
Bioorg Med Chem Lett 24: 565-70 (2014)
Article DOI: 10.1016/j.bmcl.2013.12.020
BindingDB Entry DOI: 10.7270/Q2V69M26