null
SMILES: CCS(=O)(=O)c1ccc(CC(=O)Nc2cc(c(s2)C(=O)c2ccccc2F)-c2cccc(Cl)c2)cc1
InChI Key: InChIKey=AAYKDTRBBPQGCJ-UHFFFAOYSA-N
Activity Spreadsheet -- Enzyme Inhibition Constant Data from BindingDB
Found 2 hits for monomerid = 50445880
Trg + Lig
Ki
nM
ΔG°
kcal/mole
IC50
nM
Kd
nM
EC50/IC50
nM
koff
s-1
kon
M-1s-1
pHTemp
°C
Nuclear receptor ROR-gamma
(Homo sapiens (Human))
BDBM50445880
(CHEMBL3105670)
Show SMILES CCS(=O)(=O)c1ccc(CC(=O)Nc2cc(c(s2)C(=O)c2ccccc2F)-c2cccc(Cl)c2)cc1
Show InChI InChI=1S/C27H21ClFNO4S2/c1-2-36(33,34)20-12-10-17(11-13-20)14-24(31)30-25-16-22(18-6-5-7-19(28)15-18)27(35-25)26(32)21-8-3-4-9-23(21)29/h3-13,15-16H,2,14H2,1H3,(H,30,31)
n/an/a 6.30n/an/an/an/an/an/a
GlaxoSmithKline
Curated by ChEMBL
Assay Description
Inhibition of APC-labeled RORgammat receptor ligand binding domain (unknown origin) after 1 hr by FRET assay
Bioorg Med Chem 22: 692-702 (2014)
Article DOI: 10.1016/j.bmc.2013.12.021
BindingDB Entry DOI: 10.7270/Q2Z039M7
Nuclear receptor ROR-gamma
(Mus musculus)
BDBM50445880
(CHEMBL3105670)
Show SMILES CCS(=O)(=O)c1ccc(CC(=O)Nc2cc(c(s2)C(=O)c2ccccc2F)-c2cccc(Cl)c2)cc1
Show InChI InChI=1S/C27H21ClFNO4S2/c1-2-36(33,34)20-12-10-17(11-13-20)14-24(31)30-25-16-22(18-6-5-7-19(28)15-18)27(35-25)26(32)21-8-3-4-9-23(21)29/h3-13,15-16H,2,14H2,1H3,(H,30,31)
Reactome pathway
n/an/a 10n/an/an/an/an/an/a
GlaxoSmithKline
Curated by ChEMBL
Assay Description
Inhibition of RORgammat receptor ligand binding domain in mouse spleen CD4+ T cells assessed as inhibition of IL-17 production after 3 days by ELISA
Bioorg Med Chem 22: 692-702 (2014)
Article DOI: 10.1016/j.bmc.2013.12.021
BindingDB Entry DOI: 10.7270/Q2Z039M7