BDBM50445884 CHEMBL3105686
SMILES: CCS(=O)(=O)c1ccc(CC(=O)Nc2cc(c(s2)C(=O)c2ccccc2)-c2ccccc2)cc1
InChI Key: InChIKey=JBSXPUQDSVYBAE-UHFFFAOYSA-N
Data: 2 IC50
Activity Spreadsheet -- Enzyme Inhibition Constant Data from BindingDB
Found 2 hits for monomerid = 50445884
Trg + Lig
Ki
nM
ΔG°
kcal/mole
IC50
nM
Kd
nM
EC50/IC50
nM
koff
s-1
kon
M-1s-1
pHTemp
°C
Nuclear receptor ROR-gamma
(Homo sapiens (Human))
BDBM50445884
(CHEMBL3105686)
Show SMILES CCS(=O)(=O)c1ccc(CC(=O)Nc2cc(c(s2)C(=O)c2ccccc2)-c2ccccc2)cc1
Show InChI InChI=1S/C27H23NO4S2/c1-2-34(31,32)22-15-13-19(14-16-22)17-24(29)28-25-18-23(20-9-5-3-6-10-20)27(33-25)26(30)21-11-7-4-8-12-21/h3-16,18H,2,17H2,1H3,(H,28,29)
n/an/a 10n/an/an/an/an/an/a
GlaxoSmithKline
Curated by ChEMBL
Assay Description
Inhibition of APC-labeled RORgammat receptor ligand binding domain (unknown origin) after 1 hr by FRET assay
Bioorg Med Chem 22: 692-702 (2014)
Article DOI: 10.1016/j.bmc.2013.12.021
BindingDB Entry DOI: 10.7270/Q2Z039M7
Nuclear receptor ROR-gamma
(Mus musculus)
BDBM50445884
(CHEMBL3105686)
Show SMILES CCS(=O)(=O)c1ccc(CC(=O)Nc2cc(c(s2)C(=O)c2ccccc2)-c2ccccc2)cc1
Show InChI InChI=1S/C27H23NO4S2/c1-2-34(31,32)22-15-13-19(14-16-22)17-24(29)28-25-18-23(20-9-5-3-6-10-20)27(33-25)26(30)21-11-7-4-8-12-21/h3-16,18H,2,17H2,1H3,(H,28,29)
Reactome pathway
n/an/a 50n/an/an/an/an/an/a
GlaxoSmithKline
Curated by ChEMBL
Assay Description
Inhibition of RORgammat receptor ligand binding domain in mouse spleen CD4+ T cells assessed as inhibition of IL-17 production after 3 days by ELISA
Bioorg Med Chem 22: 692-702 (2014)
Article DOI: 10.1016/j.bmc.2013.12.021
BindingDB Entry DOI: 10.7270/Q2Z039M7