BDBM50445991 CHEMBL3103134
SMILES: CS(=O)(=O)Nc1ccc2c(c[nH]c2c1)C(=O)C(=O)N1CCC(Cc2ccc(F)cc2)CC1
InChI Key: InChIKey=KHVFRSQPDAXOIK-UHFFFAOYSA-N
Data: 1 IC50
Activity Spreadsheet -- Enzyme Inhibition Constant Data from BindingDB
Found 1 hit for monomerid = 50445991
Trg + Lig
Ki
nM
ΔG°
kcal/mole
IC50
nM
Kd
nM
EC50/IC50
nM
koff
s-1
kon
M-1s-1
pHTemp
°C
Glutamate receptor ionotropic, NMDA 2B
(Rattus norvegicus (Rat))
BDBM50445991
(CHEMBL3103134)
Show SMILES CS(=O)(=O)Nc1ccc2c(c[nH]c2c1)C(=O)C(=O)N1CCC(Cc2ccc(F)cc2)CC1
Show InChI InChI=1S/C23H24FN3O4S/c1-32(30,31)26-18-6-7-19-20(14-25-21(19)13-18)22(28)23(29)27-10-8-16(9-11-27)12-15-2-4-17(24)5-3-15/h2-7,13-14,16,25-26H,8-12H2,1H3
n/an/a 18n/an/an/an/an/an/a
Universit£ di Messina
Curated by ChEMBL
Assay Description
Displacement of [3H]Ifenprodil from NMDA receptor GluN2B subunit in Wistar rat cerebral cortex
Bioorg Med Chem 22: 1040-8 (2014)
Article DOI: 10.1016/j.bmc.2013.12.040
BindingDB Entry DOI: 10.7270/Q29888GS