BDBM50446053 CHEMBL3103392
SMILES: NC(=O)N1c2ccccc2C=Cc2c1ccc1ccccc21
InChI Key: InChIKey=HNOWBOJYKLWIJN-UHFFFAOYSA-N
Data: 1 IC50
Activity Spreadsheet -- Enzyme Inhibition Constant Data from BindingDB
Found 1 hit for monomerid = 50446053
Trg + Lig
Ki
nM
ΔG°
kcal/mole
IC50
nM
Kd
nM
EC50/IC50
nM
koff
s-1
kon
M-1s-1
pHTemp
°C
P2X purinoceptor 4
(Homo sapiens (Human))
BDBM50446053
(CHEMBL3103392)
Show SMILES NC(=O)N1c2ccccc2C=Cc2c1ccc1ccccc21 |c:11|
Show InChI InChI=1S/C19H14N2O/c20-19(22)21-17-8-4-2-6-14(17)9-11-16-15-7-3-1-5-13(15)10-12-18(16)21/h1-12H,(H2,20,22)
n/an/a 5.14E+4n/an/an/an/an/an/a
University of Bonn
Curated by ChEMBL
Assay Description
Antagonist activity at human P2X4 receptor expressed in human 1321N1 cells assessed as inhibition of ATP-induced cytosolic calcium influx preincubate...
Bioorg Med Chem 22: 1077-88 (2014)
Article DOI: 10.1016/j.bmc.2013.12.035
BindingDB Entry DOI: 10.7270/Q21R6S09