BDBM50446169 CHEMBL3108987::US9518026, Example 14::US9956214, Compound 14
SMILES: CC(C)Cn1nc(c(C(N)=O)c1N)-c1ccc2ccccc2c1
InChI Key: InChIKey=QORXFUGWURPWQC-UHFFFAOYSA-N
Data: 5 IC50
Activity Spreadsheet -- Enzyme Inhibition Constant Data from BindingDB
Found 5 hits for monomerid = 50446169
Trg + Lig
Ki
nM
ΔG°
kcal/mole
IC50
nM
Kd
nM
EC50/IC50
nM
koff
s-1
kon
M-1s-1
pHTemp
°C
Calmodulin-domain protein kinase 1 (CDPK1)
(Toxoplasma gondii)
BDBM50446169
(CHEMBL3108987 | US9518026, Example 14 | US9956214,...)
Show SMILES CC(C)Cn1nc(c(C(N)=O)c1N)-c1ccc2ccccc2c1
Show InChI InChI=1S/C18H20N4O/c1-11(2)10-22-17(19)15(18(20)23)16(21-22)14-8-7-12-5-3-4-6-13(12)9-14/h3-9,11H,10,19H2,1-2H3,(H2,20,23)
n/an/a 8n/an/an/an/an/an/a
University of Washington
Curated by ChEMBL
Assay Description
Inhibition of Toxoplasma gondii CDPK1 using PLARTLSVAGLPGKK-OH as substrate
ACS Med Chem Lett 5: 40-44 (2014)
Article DOI: 10.1021/ml400315s
BindingDB Entry DOI: 10.7270/Q28917BZ
Calmodulin-domain protein kinase 1 (CDPK1)
(Toxoplasma gondii)
BDBM50446169
(CHEMBL3108987 | US9518026, Example 14 | US9956214,...)
Show SMILES CC(C)Cn1nc(c(C(N)=O)c1N)-c1ccc2ccccc2c1
Show InChI InChI=1S/C18H20N4O/c1-11(2)10-22-17(19)15(18(20)23)16(21-22)14-8-7-12-5-3-4-6-13(12)9-14/h3-9,11H,10,19H2,1-2H3,(H2,20,23)
US Patent
n/an/a 8n/an/an/an/an/an/a
University of Washington Through its Center For Commercialization
US Patent
Assay Description
Inhibition of TgCDPK1 and CpCDPK1 was determined using a luminescent kinase assay which measures ATP depletion in the presence of the Syntide 2 pepti...
US Patent US9518026 (2016)
BindingDB Entry DOI: 10.7270/Q2BV7JN4
Calcium-dependent protein kinase 1 (CDPK1)
(Cryptosporidium parvum)
BDBM50446169
(CHEMBL3108987 | US9518026, Example 14 | US9956214,...)
Show SMILES CC(C)Cn1nc(c(C(N)=O)c1N)-c1ccc2ccccc2c1
Show InChI InChI=1S/C18H20N4O/c1-11(2)10-22-17(19)15(18(20)23)16(21-22)14-8-7-12-5-3-4-6-13(12)9-14/h3-9,11H,10,19H2,1-2H3,(H2,20,23)
US Patent
n/an/a 16n/an/an/an/an/an/a
Boehringer Ingelheim (Canada) Ltd.
Assay Description
Inhibition of TgCDPK1 and CpCDPK1 was determined using a luminescent kinase assay which measures ATP depletion in the presence of the Syntide 2 pepti...
Bioorg Med Chem Lett 19: 1199-205 (2009)
BindingDB Entry DOI: 10.7270/Q23J3G91
Calmodulin-domain protein kinase 1 (CDPK1)
(Toxoplasma gondii)
BDBM50446169
(CHEMBL3108987 | US9518026, Example 14 | US9956214,...)
Show SMILES CC(C)Cn1nc(c(C(N)=O)c1N)-c1ccc2ccccc2c1
Show InChI InChI=1S/C18H20N4O/c1-11(2)10-22-17(19)15(18(20)23)16(21-22)14-8-7-12-5-3-4-6-13(12)9-14/h3-9,11H,10,19H2,1-2H3,(H2,20,23)
US Patent
n/an/a 8n/an/an/an/an/an/a
Boehringer Ingelheim (Canada) Ltd.
Assay Description
Inhibition of TgCDPK1 and CpCDPK1 was determined using a luminescent kinase assay which measures ATP depletion in the presence of the Syntide 2 pepti...
Bioorg Med Chem Lett 19: 1199-205 (2009)
BindingDB Entry DOI: 10.7270/Q23J3G91
Calmodulin-domain protein kinase (CDPK1)
(Cryptosporidium parvum)
BDBM50446169
(CHEMBL3108987 | US9518026, Example 14 | US9956214,...)
Show SMILES CC(C)Cn1nc(c(C(N)=O)c1N)-c1ccc2ccccc2c1
Show InChI InChI=1S/C18H20N4O/c1-11(2)10-22-17(19)15(18(20)23)16(21-22)14-8-7-12-5-3-4-6-13(12)9-14/h3-9,11H,10,19H2,1-2H3,(H2,20,23)
US Patent
n/an/a 16n/an/an/an/an/an/a
University of Washington Through its Center For Commercialization
US Patent
Assay Description
Inhibition of TgCDPK1 and CpCDPK1 was determined using a luminescent kinase assay which measures ATP depletion in the presence of the Syntide 2 pepti...
US Patent US9518026 (2016)
BindingDB Entry DOI: 10.7270/Q2BV7JN4