BDBM50446213 CHEMBL3109171
SMILES: O=C(N[C@H]1CO[C@@H]2[C@@H](CO[C@H]12)OCc1ccccc1)[C@H](Cc1ccccc1)NC(=O)[C@@H]1CCCN1C(=O)OCc1ccccc1
InChI Key: InChIKey=NMQZJCLOPXNPLT-ZSGYJWGQSA-N
Data: 2 IC50
Activity Spreadsheet -- Enzyme Inhibition Constant Data from BindingDB
Found 2 hits for monomerid = 50446213
Trg + Lig
Ki
nM
ΔG°
kcal/mole
IC50
nM
Kd
nM
EC50/IC50
nM
koff
s-1
kon
M-1s-1
pHTemp
°C
Kallikrein 7
(Homo sapiens (Human))
BDBM50446213
(CHEMBL3109171)
Show SMILES O=C(N[C@H]1CO[C@@H]2[C@@H](CO[C@H]12)OCc1ccccc1)[C@H](Cc1ccccc1)NC(=O)[C@@H]1CCCN1C(=O)OCc1ccccc1 |r|
Show InChI InChI=1S/C35H39N3O7/c39-33(37-28-22-43-32-30(23-44-31(28)32)42-20-25-13-6-2-7-14-25)27(19-24-11-4-1-5-12-24)36-34(40)29-17-10-18-38(29)35(41)45-21-26-15-8-3-9-16-26/h1-9,11-16,27-32H,10,17-23H2,(H,36,40)(H,37,39)/t27-,28-,29-,30+,31+,32+/m0/s1
Reactome pathway
n/an/a 2.49E+5n/an/an/an/an/an/a
Universidade Federal do ABC
Curated by ChEMBL
Assay Description
Inhibition of human recombinant KLK7 expressed in baculovirus-infected insect cell system using Abz-KLYSSKQ-Eddnp as substrate incubated for 5 mins p...
ACS Med Chem Lett 5: 128-32 (2014)
Article DOI: 10.1021/ml4003698
BindingDB Entry DOI: 10.7270/Q2W37XSV
Kallikrein 5
(Homo sapiens (Human))
BDBM50446213
(CHEMBL3109171)
Show SMILES O=C(N[C@H]1CO[C@@H]2[C@@H](CO[C@H]12)OCc1ccccc1)[C@H](Cc1ccccc1)NC(=O)[C@@H]1CCCN1C(=O)OCc1ccccc1 |r|
Show InChI InChI=1S/C35H39N3O7/c39-33(37-28-22-43-32-30(23-44-31(28)32)42-20-25-13-6-2-7-14-25)27(19-24-11-4-1-5-12-24)36-34(40)29-17-10-18-38(29)35(41)45-21-26-15-8-3-9-16-26/h1-9,11-16,27-32H,10,17-23H2,(H,36,40)(H,37,39)/t27-,28-,29-,30+,31+,32+/m0/s1
n/an/a 1.57E+5n/an/an/an/an/an/a
Universidade Federal do ABC
Curated by ChEMBL
Assay Description
Inhibition of human recombinant KLK5 expressed in baculovirus-infected insect cell system using Abz-KLRSSKQ-Eddnp as substrate incubated for 5 mins p...
ACS Med Chem Lett 5: 128-32 (2014)
Article DOI: 10.1021/ml4003698
BindingDB Entry DOI: 10.7270/Q2W37XSV