BDBM50446216 CHEMBL3109168
SMILES: CC(C)(C)OC(=O)N[C@H](COCc1ccccc1)C(=O)N[C@H]1CO[C@@H]2[C@@H](CO[C@H]12)OCc1ccccc1
InChI Key: InChIKey=ODJALUHHXJGPRG-XTAUHMBVSA-N
Data: 2 IC50
Activity Spreadsheet -- Enzyme Inhibition Constant Data from BindingDB
Found 2 hits for monomerid = 50446216
Trg + Lig
Ki
nM
ΔG°
kcal/mole
IC50
nM
Kd
nM
EC50/IC50
nM
koff
s-1
kon
M-1s-1
pHTemp
°C
Kallikrein 7
(Homo sapiens (Human))
BDBM50446216
(CHEMBL3109168)
Show SMILES CC(C)(C)OC(=O)N[C@H](COCc1ccccc1)C(=O)N[C@H]1CO[C@@H]2[C@@H](CO[C@H]12)OCc1ccccc1 |r|
Show InChI InChI=1S/C28H36N2O7/c1-28(2,3)37-27(32)30-22(16-33-14-19-10-6-4-7-11-19)26(31)29-21-17-35-25-23(18-36-24(21)25)34-15-20-12-8-5-9-13-20/h4-13,21-25H,14-18H2,1-3H3,(H,29,31)(H,30,32)/t21-,22+,23+,24+,25+/m0/s1
Reactome pathway
n/an/a 8.45E+4n/an/an/an/an/an/a
Universidade Federal do ABC
Curated by ChEMBL
Assay Description
Inhibition of human recombinant KLK7 expressed in baculovirus-infected insect cell system using Abz-KLYSSKQ-Eddnp as substrate incubated for 5 mins p...
ACS Med Chem Lett 5: 128-32 (2014)
Article DOI: 10.1021/ml4003698
BindingDB Entry DOI: 10.7270/Q2W37XSV
Kallikrein 5
(Homo sapiens (Human))
BDBM50446216
(CHEMBL3109168)
Show SMILES CC(C)(C)OC(=O)N[C@H](COCc1ccccc1)C(=O)N[C@H]1CO[C@@H]2[C@@H](CO[C@H]12)OCc1ccccc1 |r|
Show InChI InChI=1S/C28H36N2O7/c1-28(2,3)37-27(32)30-22(16-33-14-19-10-6-4-7-11-19)26(31)29-21-17-35-25-23(18-36-24(21)25)34-15-20-12-8-5-9-13-20/h4-13,21-25H,14-18H2,1-3H3,(H,29,31)(H,30,32)/t21-,22+,23+,24+,25+/m0/s1
n/an/a 5.39E+4n/an/an/an/an/an/a
Universidade Federal do ABC
Curated by ChEMBL
Assay Description
Inhibition of human recombinant KLK5 expressed in baculovirus-infected insect cell system using Abz-KLRSSKQ-Eddnp as substrate incubated for 5 mins p...
ACS Med Chem Lett 5: 128-32 (2014)
Article DOI: 10.1021/ml4003698
BindingDB Entry DOI: 10.7270/Q2W37XSV