BDBM50446266 CHEMBL3109212
SMILES: Nc1cccc(c1)-c1cnc2[nH]cc(-c3cccc(NC(=O)Nc4cc(ccc4F)C(F)(F)F)c3)c2c1
InChI Key: InChIKey=QQTPMHCXBYRWFQ-UHFFFAOYSA-N
Data: 3 IC50
Activity Spreadsheet -- Enzyme Inhibition Constant Data from BindingDB
Found 3 hits for monomerid = 50446266
Trg + Lig
Ki
nM
ΔG°
kcal/mole
IC50
nM
Kd
nM
EC50/IC50
nM
koff
s-1
kon
M-1s-1
pHTemp
°C
Receptor-interacting serine/threonine-protein kinase 1
(Homo sapiens (Human))
BDBM50446266
(CHEMBL3109212)
Show SMILES Nc1cccc(c1)-c1cnc2[nH]cc(-c3cccc(NC(=O)Nc4cc(ccc4F)C(F)(F)F)c3)c2c1
Show InChI InChI=1S/C27H19F4N5O/c28-23-8-7-18(27(29,30)31)12-24(23)36-26(37)35-20-6-2-4-16(10-20)22-14-34-25-21(22)11-17(13-33-25)15-3-1-5-19(32)9-15/h1-14H,32H2,(H,33,34)(H2,35,36,37)
n/an/a 1.30n/an/an/an/an/an/a
GlaxoSmithKline
Curated by ChEMBL
Assay Description
Displacement of (14-(2-{[3-({2-{[4-(cyanomethyl)phenyl]amino}-6-[(5-cyclopropyl-1H-pyrazol-3-yl)amino]-4-pyrimidinyl}amino)propyl]amino}-2-oxoethyl)-...
ACS Med Chem Lett 4: 1238-43 (2013)
Article DOI: 10.1021/ml400382p
BindingDB Entry DOI: 10.7270/Q2C24XW2
Receptor-interacting serine/threonine-protein kinase 1
(Homo sapiens (Human))
BDBM50446266
(CHEMBL3109212)
Show SMILES Nc1cccc(c1)-c1cnc2[nH]cc(-c3cccc(NC(=O)Nc4cc(ccc4F)C(F)(F)F)c3)c2c1
Show InChI InChI=1S/C27H19F4N5O/c28-23-8-7-18(27(29,30)31)12-24(23)36-26(37)35-20-6-2-4-16(10-20)22-14-34-25-21(22)11-17(13-33-25)15-3-1-5-19(32)9-15/h1-14H,32H2,(H,33,34)(H2,35,36,37)
n/an/a 32n/an/an/an/an/an/a
GlaxoSmithKline
Curated by ChEMBL
Assay Description
Inhibition of human N-terminal His-GST-TEV-fused RIP1 kinase domain (1 to 375) autophosphorylation expressed in baculovirus infected insect Sf9 cells...
ACS Med Chem Lett 4: 1238-43 (2013)
Article DOI: 10.1021/ml400382p
BindingDB Entry DOI: 10.7270/Q2C24XW2
Receptor-interacting serine/threonine-protein kinase 1
(Homo sapiens (Human))
BDBM50446266
(CHEMBL3109212)
Show SMILES Nc1cccc(c1)-c1cnc2[nH]cc(-c3cccc(NC(=O)Nc4cc(ccc4F)C(F)(F)F)c3)c2c1
Show InChI InChI=1S/C27H19F4N5O/c28-23-8-7-18(27(29,30)31)12-24(23)36-26(37)35-20-6-2-4-16(10-20)22-14-34-25-21(22)11-17(13-33-25)15-3-1-5-19(32)9-15/h1-14H,32H2,(H,33,34)(H2,35,36,37)
n/an/a 16n/an/an/an/an/an/a
GlaxoSmithKline
Curated by ChEMBL
Assay Description
Inhibition of RIP1 in human U937 cells assessed as prevention of TNFalpha/zVAD.fmk-induced necrotic cell death preincubated for 30 to 60 mins followe...
ACS Med Chem Lett 4: 1238-43 (2013)
Article DOI: 10.1021/ml400382p
BindingDB Entry DOI: 10.7270/Q2C24XW2