BDBM50446313 CHEMBL3109349
SMILES: COCCOc1ccn2c(cnc2c1)-c1ccc2cccc(OCC3CNCCO3)c2n1
InChI Key: InChIKey=TZIXXHVIMUUDMH-UHFFFAOYSA-N
Data: 2 IC50
Activity Spreadsheet -- Enzyme Inhibition Constant Data from BindingDB
Found 2 hits for monomerid = 50446313
Trg + Lig
Ki
nM
ΔG°
kcal/mole
IC50
nM
Kd
nM
EC50/IC50
nM
koff
s-1
kon
M-1s-1
pHTemp
°C
Platelet-derived growth factor receptor beta
(Mus musculus (mouse))
BDBM50446313
(CHEMBL3109349)
Show SMILES COCCOc1ccn2c(cnc2c1)-c1ccc2cccc(OCC3CNCCO3)c2n1
Show InChI InChI=1S/C24H26N4O4/c1-29-11-12-31-18-7-9-28-21(15-26-23(28)13-18)20-6-5-17-3-2-4-22(24(17)27-20)32-16-19-14-25-8-10-30-19/h2-7,9,13,15,19,25H,8,10-12,14,16H2,1H3
n/an/a 160n/an/an/an/an/an/a
Array BioPharma
Curated by ChEMBL
Assay Description
Inhibition of PDGF-induced PDGFRbeta phosphorylation in mouse NIH3T3 cells incubated for 1 hr prior to PDGF induction measured after 15 mins by fluor...
ACS Med Chem Lett 5: 78-83 (2014)
Article DOI: 10.1021/ml4003953
BindingDB Entry DOI: 10.7270/Q23N24VQ
Macrophage colony stimulating factor receptor
(Homo sapiens (Human))
BDBM50446313
(CHEMBL3109349)
Show SMILES COCCOc1ccn2c(cnc2c1)-c1ccc2cccc(OCC3CNCCO3)c2n1
Show InChI InChI=1S/C24H26N4O4/c1-29-11-12-31-18-7-9-28-21(15-26-23(28)13-18)20-6-5-17-3-2-4-22(24(17)27-20)32-16-19-14-25-8-10-30-19/h2-7,9,13,15,19,25H,8,10-12,14,16H2,1H3
n/an/a>1.00E+3n/an/an/an/an/an/a
Array BioPharma
Curated by ChEMBL
Assay Description
Inhibition of cFMS (unknown origin)
ACS Med Chem Lett 5: 78-83 (2014)
Article DOI: 10.1021/ml4003953
BindingDB Entry DOI: 10.7270/Q23N24VQ