BDBM50446379 CHEMBL3109638
SMILES: COc1cc2c(cc1OCCCN1CC[C@H](F)C1)N=C(N)C21CCC1
InChI Key: InChIKey=BDKDIFMYLGMBDI-ZDUSSCGKSA-N
Data: 1 IC50
Activity Spreadsheet -- Enzyme Inhibition Constant Data from BindingDB
Found 1 hit for monomerid = 50446379
Trg + Lig
Ki
nM
ΔG°
kcal/mole
IC50
nM
Kd
nM
EC50/IC50
nM
koff
s-1
kon
M-1s-1
pHTemp
°C
Protein G9a (G9a)
(Homo sapiens (Human))
BDBM50446379
(CHEMBL3109638)
Show SMILES COc1cc2c(cc1OCCCN1CC[C@H](F)C1)N=C(N)C21CCC1 |r,t:20|
Show InChI InChI=1S/C19H26FN3O2/c1-24-16-10-14-15(22-18(21)19(14)5-2-6-19)11-17(16)25-9-3-7-23-8-4-13(20)12-23/h10-11,13H,2-9,12H2,1H3,(H2,21,22)/t13-/m0/s1
n/an/a 18n/an/an/an/an/an/a
AbbVie Inc.
Curated by ChEMBL
Assay Description
Inhibition of G9a (unknown origin) using biotinylated-histone H3(1-21) peptide as substrate after 3 hrs by AlphaLISA assay
ACS Med Chem Lett 5: 205-9 (2014)
Article DOI: 10.1021/ml400496h
BindingDB Entry DOI: 10.7270/Q2FT8NJ0