BDBM50446403 CHEMBL3109725
SMILES: Oc1ccc(-c2csc3ccccc23)c(O)c1
InChI Key: InChIKey=NRPJYIQZRBZZTI-UHFFFAOYSA-N
Data: 2 IC50
Activity Spreadsheet -- Enzyme Inhibition Constant Data from BindingDB
Found 2 hits for monomerid = 50446403
Trg + Lig
Ki
nM
ΔG°
kcal/mole
IC50
nM
Kd
nM
EC50/IC50
nM
koff
s-1
kon
M-1s-1
pHTemp
°C
Arachidonate 5-lipoxygenase
(Homo sapiens (Human))
BDBM50446403
(CHEMBL3109725)
Show SMILES Oc1ccc(-c2csc3ccccc23)c(O)c1
Show InChI InChI=1S/C14H10O2S/c15-9-5-6-10(13(16)7-9)12-8-17-14-4-2-1-3-11(12)14/h1-8,15-16H
Reactome pathway
n/an/a>1.00E+4n/an/an/an/an/an/a
University of Salerno
Curated by ChEMBL
Assay Description
Inhibition of 5-LO in human PMNL using arachidonic acid as substrate preincubated for 15 mins
Eur J Med Chem 67: 269-79 (2013)
Article DOI: 10.1016/j.ejmech.2013.06.039
BindingDB Entry DOI: 10.7270/Q2XW4M9Z
Arachidonate 5-lipoxygenase
(Homo sapiens (Human))
BDBM50446403
(CHEMBL3109725)
Show SMILES Oc1ccc(-c2csc3ccccc23)c(O)c1
Show InChI InChI=1S/C14H10O2S/c15-9-5-6-10(13(16)7-9)12-8-17-14-4-2-1-3-11(12)14/h1-8,15-16H
Reactome pathway
n/an/a>1.00E+4n/an/an/an/an/an/a
University of Salerno
Curated by ChEMBL
Assay Description
Inhibition of human recombinant 5-LO expressed in Escherichia coli BL21 using arachidonic acid as substrate after 10 mins
Eur J Med Chem 67: 269-79 (2013)
Article DOI: 10.1016/j.ejmech.2013.06.039
BindingDB Entry DOI: 10.7270/Q2XW4M9Z