BDBM50446562 CHEMBL3110216
SMILES: Nc1ncnc2n([C@@H]3O[C@H](COP(O)(=O)OP(O)(=O)OC[C@H]4OC(O)[C@H](O)[C@@H]4O)[C@@H](O)[C@H]3O)c(Br)nc12
InChI Key: InChIKey=DPZGAPGUTMHLAW-DBINCYRJSA-N
Data: 1 IC50
Activity Spreadsheet -- Enzyme Inhibition Constant Data from BindingDB
Found 1 hit for monomerid = 50446562
Trg + Lig
Ki
nM
ΔG°
kcal/mole
IC50
nM
Kd
nM
EC50/IC50
nM
koff
s-1
kon
M-1s-1
pHTemp
°C
Transient receptor potential cation channel subfamily M member 2
(Homo sapiens (Human))
BDBM50446562
(CHEMBL3110216)
Show SMILES Nc1ncnc2n([C@@H]3O[C@H](COP(O)(=O)OP(O)(=O)OC[C@H]4OC(O)[C@H](O)[C@@H]4O)[C@@H](O)[C@H]3O)c(Br)nc12 |r|
Show InChI InChI=1S/C15H22BrN5O14P2/c16-15-20-6-11(17)18-3-19-12(6)21(15)13-9(24)7(22)4(33-13)1-31-36(27,28)35-37(29,30)32-2-5-8(23)10(25)14(26)34-5/h3-5,7-10,13-14,22-26H,1-2H2,(H,27,28)(H,29,30)(H2,17,18,19)/t4-,5-,7-,8-,9-,10-,13-,14?/m1/s1
Reactome pathway
n/an/a 3.00E+5n/an/an/an/an/an/a
University of Bath
Curated by ChEMBL
Assay Description
Antagonist activity at human TRPM2 expressed in HEK293 cells assessed as inhibition of ADPR-induced maximum outward potassium current at +15 mV by wh...
J Med Chem 56: 10079-102 (2013)
Article DOI: 10.1021/jm401497a
BindingDB Entry DOI: 10.7270/Q2CZ38P3