BDBM50447083 CHEMBL3112855::US9133168, Example 2d
SMILES: O=C(Cc1nc(cc(=O)[nH]1)N1CCOCC1)N1CCc2c1cccc2-c1ccccc1
InChI Key: InChIKey=WBLYYZMOJFRKFU-UHFFFAOYSA-N
Data: 7 IC50
Activity Spreadsheet -- Enzyme Inhibition Constant Data from BindingDB
Found 7 hits for monomerid = 50447083
Trg + Lig
Ki
nM
ΔG°
kcal/mole
IC50
nM
Kd
nM
EC50/IC50
nM
koff
s-1
kon
M-1s-1
pHTemp
°C
RAC-alpha serine/threonine-protein kinase
(Homo sapiens (Human))
BDBM50447083
(CHEMBL3112855 | US9133168, Example 2d)
Show SMILES O=C(Cc1nc(cc(=O)[nH]1)N1CCOCC1)N1CCc2c1cccc2-c1ccccc1
Show InChI InChI=1S/C24H24N4O3/c29-23-16-22(27-11-13-31-14-12-27)25-21(26-23)15-24(30)28-10-9-19-18(7-4-8-20(19)28)17-5-2-1-3-6-17/h1-8,16H,9-15H2,(H,25,26,29)
US Patent
n/an/a 24n/an/an/an/an/an/a
SANOFI
US Patent
Assay Description
This test is based on measurement of the expression of AKT protein phosphorylated on serine 473 (P-AKT-S473) in the PC3 human prostate carcinoma line...
US Patent US9133168 (2015)
BindingDB Entry DOI: 10.7270/Q29W0D8X
Cytochrome P450 3A4
(Homo sapiens (Human))
BDBM50447083
(CHEMBL3112855 | US9133168, Example 2d)
Show SMILES O=C(Cc1nc(cc(=O)[nH]1)N1CCOCC1)N1CCc2c1cccc2-c1ccccc1
Show InChI InChI=1S/C24H24N4O3/c29-23-16-22(27-11-13-31-14-12-27)25-21(26-23)15-24(30)28-10-9-19-18(7-4-8-20(19)28)17-5-2-1-3-6-17/h1-8,16H,9-15H2,(H,25,26,29)
Reactome pathway
n/an/a 4.00E+4n/an/an/an/an/an/a
Sanofi
Curated by ChEMBL
Assay Description
Inhibition of recombinant human CYP3A4
J Med Chem 57: 903-20 (2014)
Article DOI: 10.1021/jm401642q
BindingDB Entry DOI: 10.7270/Q2R212VJ
Phosphatidylinositol 4,5-bisphosphate 3-kinase catalytic subunit beta isoform
(Homo sapiens (Human))
BDBM50447083
(CHEMBL3112855 | US9133168, Example 2d)
Show SMILES O=C(Cc1nc(cc(=O)[nH]1)N1CCOCC1)N1CCc2c1cccc2-c1ccccc1
Show InChI InChI=1S/C24H24N4O3/c29-23-16-22(27-11-13-31-14-12-27)25-21(26-23)15-24(30)28-10-9-19-18(7-4-8-20(19)28)17-5-2-1-3-6-17/h1-8,16H,9-15H2,(H,25,26,29)
NCI pathway
Reactome pathway
n/an/a 8n/an/an/an/an/an/a
Sanofi
Curated by ChEMBL
Assay Description
Inhibition of N-terminal ploy-His-tagged human PI3Kbeta expressed in baculovirus-infected sf21 cells using PI(4,5)P2 as substrate after 15 mins by HT...
J Med Chem 57: 903-20 (2014)
Article DOI: 10.1021/jm401642q
BindingDB Entry DOI: 10.7270/Q2R212VJ
Phosphatidylinositol 4,5-bisphosphate 3-kinase catalytic subunit beta isoform
(Homo sapiens (Human))
BDBM50447083
(CHEMBL3112855 | US9133168, Example 2d)
Show SMILES O=C(Cc1nc(cc(=O)[nH]1)N1CCOCC1)N1CCc2c1cccc2-c1ccccc1
Show InChI InChI=1S/C24H24N4O3/c29-23-16-22(27-11-13-31-14-12-27)25-21(26-23)15-24(30)28-10-9-19-18(7-4-8-20(19)28)17-5-2-1-3-6-17/h1-8,16H,9-15H2,(H,25,26,29)
NCI pathway
Reactome pathway
n/an/a 24n/an/an/an/an/an/a
Sanofi
Curated by ChEMBL
Assay Description
Inhibition of N-terminal ploy-His-tagged human PI3Kbeta expressed in baculovirus-infected sf21 cells using PI(4,5)P2 as substrate after 15 mins by HT...
J Med Chem 57: 903-20 (2014)
Article DOI: 10.1021/jm401642q
BindingDB Entry DOI: 10.7270/Q2R212VJ
Phosphatidylinositol 4,5-bisphosphate 3-kinase catalytic subunit delta isoform
(Homo sapiens (Human))
BDBM50447083
(CHEMBL3112855 | US9133168, Example 2d)
Show SMILES O=C(Cc1nc(cc(=O)[nH]1)N1CCOCC1)N1CCc2c1cccc2-c1ccccc1
Show InChI InChI=1S/C24H24N4O3/c29-23-16-22(27-11-13-31-14-12-27)25-21(26-23)15-24(30)28-10-9-19-18(7-4-8-20(19)28)17-5-2-1-3-6-17/h1-8,16H,9-15H2,(H,25,26,29)
NCI pathway
Reactome pathway
n/an/a 18n/an/an/an/an/an/a
Sanofi
Curated by ChEMBL
Assay Description
Inhibition of N-terminal ploy-His-tagged human PI3Kdelta expressed in baculovirus-infected sf9 cells using PI(4,5)P2 as substrate after 15 mins by HT...
J Med Chem 57: 903-20 (2014)
Article DOI: 10.1021/jm401642q
BindingDB Entry DOI: 10.7270/Q2R212VJ
Phosphatidylinositol 4,5-bisphosphate 3-kinase catalytic subunit alpha isoform
(Homo sapiens (Human))
BDBM50447083
(CHEMBL3112855 | US9133168, Example 2d)
Show SMILES O=C(Cc1nc(cc(=O)[nH]1)N1CCOCC1)N1CCc2c1cccc2-c1ccccc1
Show InChI InChI=1S/C24H24N4O3/c29-23-16-22(27-11-13-31-14-12-27)25-21(26-23)15-24(30)28-10-9-19-18(7-4-8-20(19)28)17-5-2-1-3-6-17/h1-8,16H,9-15H2,(H,25,26,29)
NCI pathway
Reactome pathway
n/an/a 217n/an/an/an/an/an/a
Sanofi
Curated by ChEMBL
Assay Description
Inhibition of N-terminal ploy-His-tagged human PI3Kalpha expressed in baculovirus-infected sf9 cells using PI(4,5)P2 as substrate after 15 mins by HT...
J Med Chem 57: 903-20 (2014)
Article DOI: 10.1021/jm401642q
BindingDB Entry DOI: 10.7270/Q2R212VJ
Phosphatidylinositol 4,5-bisphosphate 3-kinase catalytic subunit gamma isoform
(Homo sapiens (Human))
BDBM50447083
(CHEMBL3112855 | US9133168, Example 2d)
Show SMILES O=C(Cc1nc(cc(=O)[nH]1)N1CCOCC1)N1CCc2c1cccc2-c1ccccc1
Show InChI InChI=1S/C24H24N4O3/c29-23-16-22(27-11-13-31-14-12-27)25-21(26-23)15-24(30)28-10-9-19-18(7-4-8-20(19)28)17-5-2-1-3-6-17/h1-8,16H,9-15H2,(H,25,26,29)
NCI pathway
Reactome pathway
n/an/a 1.53E+3n/an/an/an/an/an/a
Sanofi
Curated by ChEMBL
Assay Description
Inhibition of C-terminal ploy-His-tagged human PI3Kgamma expressed in baculovirus-infected sf9 cells using PI(4,5)P2 as substrate after 15 mins by HT...
J Med Chem 57: 903-20 (2014)
Article DOI: 10.1021/jm401642q
BindingDB Entry DOI: 10.7270/Q2R212VJ