BDBM50447269 CHEMBL3113989
SMILES: C[C@](O)(c1ccc(cc1)N1CCN(C[C@@H]1CN1[C@@H]2C[C@@H](O)[C@H]1COC2)S(=O)(=O)c1cccs1)C(F)(F)F
InChI Key: InChIKey=YCEQAJBFIXGCSK-GJTYKATRSA-N
Data: 1 IC50  1 EC50
Activity Spreadsheet -- Enzyme Inhibition Constant Data from BindingDB
Found 2 hits for monomerid = 50447269
Trg + Lig
Ki
nM
ΔG°
kcal/mole
IC50
nM
Kd
nM
EC50/IC50
nM
koff
s-1
kon
M-1s-1
pHTemp
°C
Hexokinase-4
(Mus musculus (Mouse))
BDBM50447269
(CHEMBL3113989)
Show SMILES C[C@](O)(c1ccc(cc1)N1CCN(C[C@@H]1CN1[C@@H]2C[C@@H](O)[C@H]1COC2)S(=O)(=O)c1cccs1)C(F)(F)F |r,THB:15:16:18.19:23.22.24,20:19:16:23.22.24|
Show InChI InChI=1S/C24H30F3N3O5S2/c1-23(32,24(25,26)27)16-4-6-17(7-5-16)29-9-8-28(37(33,34)22-3-2-10-36-22)12-19(29)13-30-18-11-21(31)20(30)15-35-14-18/h2-7,10,18-21,31-32H,8-9,11-15H2,1H3/t18-,19-,20-,21-,23+/m1/s1
n/an/an/an/a 4.76E+3n/an/an/an/a
Amgen Inc.
Curated by ChEMBL
Assay Description
Induction of GK translocation from nucleus to cytoplasm of mouse hepatocytes preincubated for 20 mins followed by glucose challenge measured after 40...
J Med Chem 57: 325-38 (2014)
Article DOI: 10.1021/jm4016747
BindingDB Entry DOI: 10.7270/Q2Q241Q5
Hexokinase-4
(Homo sapiens (Human))
BDBM50447269
(CHEMBL3113989)
Show SMILES C[C@](O)(c1ccc(cc1)N1CCN(C[C@@H]1CN1[C@@H]2C[C@@H](O)[C@H]1COC2)S(=O)(=O)c1cccs1)C(F)(F)F |r,THB:15:16:18.19:23.22.24,20:19:16:23.22.24|
Show InChI InChI=1S/C24H30F3N3O5S2/c1-23(32,24(25,26)27)16-4-6-17(7-5-16)29-9-8-28(37(33,34)22-3-2-10-36-22)12-19(29)13-30-18-11-21(31)20(30)15-35-14-18/h2-7,10,18-21,31-32H,8-9,11-15H2,1H3/t18-,19-,20-,21-,23+/m1/s1
NCI pathway
Reactome pathway
n/an/a 16n/an/an/an/an/an/a
Amgen Inc.
Curated by ChEMBL
Assay Description
Inhibition of fluorescein-labeled human GK interaction with biotin-labeled human GKRP incubated for 20 mins prior to addition of fluorescein-labeled ...
J Med Chem 57: 325-38 (2014)
Article DOI: 10.1021/jm4016747
BindingDB Entry DOI: 10.7270/Q2Q241Q5