null
SMILES: Nc1ccc(cc1)S(=O)(=O)N1CCN(CC1)c1ccc(cc1)C(O)(C(F)(F)F)C(F)(F)F
InChI Key: InChIKey=OXAMCUVKMNJUGK-UHFFFAOYSA-N
Activity Spreadsheet -- Enzyme Inhibition Constant Data from BindingDB
Found 2 hits for monomerid = 50447288
Trg + Lig
Ki
nM
ΔG°
kcal/mole
IC50
nM
Kd
nM
EC50/IC50
nM
koff
s-1
kon
M-1s-1
pHTemp
°C
Hexokinase-4
(Mus musculus (Mouse))
BDBM50447288
(CHEMBL3113998)
Show SMILES Nc1ccc(cc1)S(=O)(=O)N1CCN(CC1)c1ccc(cc1)C(O)(C(F)(F)F)C(F)(F)F
Show InChI InChI=1S/C19H19F6N3O3S/c20-18(21,22)17(29,19(23,24)25)13-1-5-15(6-2-13)27-9-11-28(12-10-27)32(30,31)16-7-3-14(26)4-8-16/h1-8,29H,9-12,26H2
n/an/an/an/a>1.25E+4n/an/an/an/a
Amgen Inc.
Curated by ChEMBL
Assay Description
Induction of GK translocation from nucleus to cytoplasm of mouse hepatocytes preincubated for 20 mins followed by glucose challenge measured after 40...
J Med Chem 57: 325-38 (2014)
Article DOI: 10.1021/jm4016747
BindingDB Entry DOI: 10.7270/Q2Q241Q5
Hexokinase-4
(Homo sapiens (Human))
BDBM50447288
(CHEMBL3113998)
Show SMILES Nc1ccc(cc1)S(=O)(=O)N1CCN(CC1)c1ccc(cc1)C(O)(C(F)(F)F)C(F)(F)F
Show InChI InChI=1S/C19H19F6N3O3S/c20-18(21,22)17(29,19(23,24)25)13-1-5-15(6-2-13)27-9-11-28(12-10-27)32(30,31)16-7-3-14(26)4-8-16/h1-8,29H,9-12,26H2
NCI pathway
Reactome pathway
n/an/a 484n/an/an/an/an/an/a
Amgen Inc.
Curated by ChEMBL
Assay Description
Inhibition of fluorescein-labeled human GK interaction with biotin-labeled human GKRP incubated for 20 mins prior to addition of fluorescein-labeled ...
J Med Chem 57: 325-38 (2014)
Article DOI: 10.1021/jm4016747
BindingDB Entry DOI: 10.7270/Q2Q241Q5