BDBM50447295 CHEMBL3114192
SMILES: CCNC(=O)Nc1nc2cc(-c3ccc4nnnn4c3)c(=O)n(C(C)C)c2s1
InChI Key: InChIKey=YXEMZXLVGMJZKR-UHFFFAOYSA-N
Data: 1 IC50
Activity Spreadsheet -- Enzyme Inhibition Constant Data from BindingDB
Found 1 hit for monomerid = 50447295
Trg + Lig
Ki
nM
ΔG°
kcal/mole
IC50
nM
Kd
nM
EC50/IC50
nM
koff
s-1
kon
M-1s-1
pHTemp
°C
DNA gyrase subunit B
(Mycobacterium smegmatis)
BDBM50447295
(CHEMBL3114192)
Show SMILES CCNC(=O)Nc1nc2cc(-c3ccc4nnnn4c3)c(=O)n(C(C)C)c2s1
Show InChI InChI=1S/C17H18N8O2S/c1-4-18-16(27)20-17-19-12-7-11(14(26)25(9(2)3)15(12)28-17)10-5-6-13-21-22-23-24(13)8-10/h5-9H,4H2,1-3H3,(H2,18,19,20,27)
n/an/a 20n/an/an/an/an/an/a
AstraZeneca
Curated by ChEMBL
Assay Description
Inhibition of Mycobacterium smegmatis DNA gyrase B ATPase activity after 100 mins
Bioorg Med Chem Lett 24: 870-9 (2014)
Article DOI: 10.1016/j.bmcl.2013.12.080
BindingDB Entry DOI: 10.7270/Q2K9390V