BDBM50447307 CHEMBL3114198
SMILES: CCNC(=O)Nc1nc2cc(-c3cncc(F)c3)c(=O)n(C(C)C)c2s1
InChI Key: InChIKey=UOTOVOLUGUVSRN-UHFFFAOYSA-N
Data: 1 IC50
Activity Spreadsheet -- Enzyme Inhibition Constant Data from BindingDB
Found 1 hit for monomerid = 50447307
Trg + Lig
Ki
nM
ΔG°
kcal/mole
IC50
nM
Kd
nM
EC50/IC50
nM
koff
s-1
kon
M-1s-1
pHTemp
°C
DNA gyrase subunit B
(Mycobacterium smegmatis)
BDBM50447307
(CHEMBL3114198)
Show SMILES CCNC(=O)Nc1nc2cc(-c3cncc(F)c3)c(=O)n(C(C)C)c2s1
Show InChI InChI=1S/C17H18FN5O2S/c1-4-20-16(25)22-17-21-13-6-12(10-5-11(18)8-19-7-10)14(24)23(9(2)3)15(13)26-17/h5-9H,4H2,1-3H3,(H2,20,21,22,25)
n/an/a 10n/an/an/an/an/an/a
AstraZeneca
Curated by ChEMBL
Assay Description
Inhibition of Mycobacterium smegmatis DNA gyrase B ATPase activity after 100 mins
Bioorg Med Chem Lett 24: 870-9 (2014)
Article DOI: 10.1016/j.bmcl.2013.12.080
BindingDB Entry DOI: 10.7270/Q2K9390V