BDBM50447319 CHEMBL3114215
SMILES: CCNC(=O)Nc1nc2cc(-c3cccnc3)c(=O)n(CC)c2s1
InChI Key: InChIKey=JSVBXPDVCMCJQE-UHFFFAOYSA-N
Data: 1 IC50
Activity Spreadsheet -- Enzyme Inhibition Constant Data from BindingDB
Found 1 hit for monomerid = 50447319
Trg + Lig
Ki
nM
ΔG°
kcal/mole
IC50
nM
Kd
nM
EC50/IC50
nM
koff
s-1
kon
M-1s-1
pHTemp
°C
DNA gyrase subunit B
(Mycobacterium smegmatis)
BDBM50447319
(CHEMBL3114215)
Show SMILES CCNC(=O)Nc1nc2cc(-c3cccnc3)c(=O)n(CC)c2s1
Show InChI InChI=1S/C16H17N5O2S/c1-3-18-15(23)20-16-19-12-8-11(10-6-5-7-17-9-10)13(22)21(4-2)14(12)24-16/h5-9H,3-4H2,1-2H3,(H2,18,19,20,23)
n/an/a 30n/an/an/an/an/an/a
AstraZeneca
Curated by ChEMBL
Assay Description
Inhibition of Mycobacterium smegmatis DNA gyrase B ATPase activity after 100 mins
Bioorg Med Chem Lett 24: 870-9 (2014)
Article DOI: 10.1016/j.bmcl.2013.12.080
BindingDB Entry DOI: 10.7270/Q2K9390V