BDBM50447325 CHEMBL3114676
SMILES: CC(C)(C)CCN1[C@H](S[C@@H](CC(=O)N2CCC(CC2)N2CCc3ccccc3NC2=O)C1=O)c1cccc(F)c1N1CCN(CC1)C(C)(C)C
InChI Key: InChIKey=CWVIRPPISINNPT-LBHUVFDKSA-N
Data: 1 KI  1 IC50
Activity Spreadsheet -- Enzyme Inhibition Constant Data from BindingDB
Found 2 hits for monomerid = 50447325
Trg + Lig
Ki
nM
ΔG°
kcal/mole
IC50
nM
Kd
nM
EC50/IC50
nM
koff
s-1
kon
M-1s-1
pHTemp
°C
Calcitonin gene-related peptide type 1 receptor
(Homo sapiens (Human))
BDBM50447325
(CHEMBL3114676)
Show SMILES CC(C)(C)CCN1[C@H](S[C@@H](CC(=O)N2CCC(CC2)N2CCc3ccccc3NC2=O)C1=O)c1cccc(F)c1N1CCN(CC1)C(C)(C)C |r|
Show InChI InChI=1S/C39H55FN6O3S/c1-38(2,3)17-21-46-35(48)32(50-36(46)29-11-9-12-30(40)34(29)43-22-24-44(25-23-43)39(4,5)6)26-33(47)42-18-15-28(16-19-42)45-20-14-27-10-7-8-13-31(27)41-37(45)49/h7-13,28,32,36H,14-26H2,1-6H3,(H,41,49)/t32-,36+/m0/s1
Reactome pathway
0.0300n/an/an/an/an/an/an/an/a
Vertex Pharmaceuticals Inc.
Curated by ChEMBL
Assay Description
Displacement of [125I]CGRP from CGRP receptor in human SK-N-MC cell membranes preincubated for 30 mins followed by radioligand addition measured afte...
Bioorg Med Chem Lett 24: 845-9 (2014)
Article DOI: 10.1016/j.bmcl.2013.12.089
BindingDB Entry DOI: 10.7270/Q2FJ2J84
Calcitonin gene-related peptide type 1 receptor
(Homo sapiens (Human))
BDBM50447325
(CHEMBL3114676)
Show SMILES CC(C)(C)CCN1[C@H](S[C@@H](CC(=O)N2CCC(CC2)N2CCc3ccccc3NC2=O)C1=O)c1cccc(F)c1N1CCN(CC1)C(C)(C)C |r|
Show InChI InChI=1S/C39H55FN6O3S/c1-38(2,3)17-21-46-35(48)32(50-36(46)29-11-9-12-30(40)34(29)43-22-24-44(25-23-43)39(4,5)6)26-33(47)42-18-15-28(16-19-42)45-20-14-27-10-7-8-13-31(27)41-37(45)49/h7-13,28,32,36H,14-26H2,1-6H3,(H,41,49)/t32-,36+/m0/s1
Reactome pathway
n/an/a 1n/an/an/an/an/an/a
Vertex Pharmaceuticals Inc.
Curated by ChEMBL
Assay Description
Antagonist activity at CGRP receptor in human SK-N-MC cells assessed as inhibition of CGRP-stimulated cAMP production preincubated for 30 mins follow...
Bioorg Med Chem Lett 24: 845-9 (2014)
Article DOI: 10.1016/j.bmcl.2013.12.089
BindingDB Entry DOI: 10.7270/Q2FJ2J84