BDBM50447526 CHEMBL3115907
SMILES: NC(=N)c1ccc(CNC(=O)[C@H](CC2CCCN2)NC(=O)[C@@H](CC2CCCCC2)NCC(O)=O)cc1
InChI Key: InChIKey=DWOQERKVOXNSSI-PDQYLBCOSA-N
Data: 1 KI  1 IC50
Activity Spreadsheet -- Enzyme Inhibition Constant Data from BindingDB
Found 2 hits for monomerid = 50447526
Trg + Lig
Ki
nM
ΔG°
kcal/mole
IC50
nM
Kd
nM
EC50/IC50
nM
koff
s-1
kon
M-1s-1
pHTemp
°C
Vitamin K-dependent protein C
(Homo sapiens (Human))
BDBM50447526
(CHEMBL3115907)
Show SMILES NC(=N)c1ccc(CNC(=O)[C@H](CC2CCCN2)NC(=O)[C@@H](CC2CCCCC2)NCC(O)=O)cc1 |r|
Show InChI InChI=1S/C26H40N6O4/c27-24(28)19-10-8-18(9-11-19)15-31-25(35)22(14-20-7-4-12-29-20)32-26(36)21(30-16-23(33)34)13-17-5-2-1-3-6-17/h8-11,17,20-22,29-30H,1-7,12-16H2,(H3,27,28)(H,31,35)(H,32,36)(H,33,34)/t20?,21-,22+/m1/s1
Reactome pathway
1.60E+3n/an/an/an/an/an/an/an/a
AstraZeneca
Curated by ChEMBL
Assay Description
Competitive inhibition of human APC using S-2366 as substrate
Bioorg Med Chem Lett 24: 821-7 (2014)
Article DOI: 10.1016/j.bmcl.2013.12.094
BindingDB Entry DOI: 10.7270/Q2542Q3B
Vitamin K-dependent protein C
(Homo sapiens (Human))
BDBM50447526
(CHEMBL3115907)
Show SMILES NC(=N)c1ccc(CNC(=O)[C@H](CC2CCCN2)NC(=O)[C@@H](CC2CCCCC2)NCC(O)=O)cc1 |r|
Show InChI InChI=1S/C26H40N6O4/c27-24(28)19-10-8-18(9-11-19)15-31-25(35)22(14-20-7-4-12-29-20)32-26(36)21(30-16-23(33)34)13-17-5-2-1-3-6-17/h8-11,17,20-22,29-30H,1-7,12-16H2,(H3,27,28)(H,31,35)(H,32,36)(H,33,34)/t20?,21-,22+/m1/s1
Reactome pathway
n/an/a 5.60E+3n/an/an/an/an/an/a
AstraZeneca
Curated by ChEMBL
Assay Description
Inhibition of human APC using S-2366 as substrate preincubated for 300 seconds followed by substrate addition measured after 40 mins by spectrophotom...
Bioorg Med Chem Lett 24: 821-7 (2014)
Article DOI: 10.1016/j.bmcl.2013.12.094
BindingDB Entry DOI: 10.7270/Q2542Q3B