BDBM50447651 CHEMBL3112741
SMILES: OS(=O)(=O)ON1[C@H]2CN([C@@H](CC2)C(=O)NC2CCNCC2)C1=O
InChI Key: InChIKey=SMOBCLHAZXOKDQ-ZJUUUORDSA-N
Data: 1 IC50
Activity Spreadsheet -- Enzyme Inhibition Constant Data from BindingDB
Found 1 hit for monomerid = 50447651
Trg + Lig
Ki
nM
ΔG°
kcal/mole
IC50
nM
Kd
nM
EC50/IC50
nM
koff
s-1
kon
M-1s-1
pHTemp
°C
Beta-lactamase
(Acinetobacter baumannii)
BDBM50447651
(CHEMBL3112741)
Show SMILES OS(=O)(=O)ON1[C@H]2CN([C@@H](CC2)C(=O)NC2CCNCC2)C1=O |r|
Show InChI InChI=1S/C12H20N4O6S/c17-11(14-8-3-5-13-6-4-8)10-2-1-9-7-15(10)12(18)16(9)22-23(19,20)21/h8-10,13H,1-7H2,(H,14,17)(H,19,20,21)/t9-,10+/m1/s1
n/an/a>5.00E+4n/an/an/an/an/an/a
Merck Research Labs
Curated by ChEMBL
Assay Description
Inhibition of beta-lactamase Oxa40 in Acinetobacter baumannii assessed as inhibition of hydrolysis of nitrocefin
Bioorg Med Chem Lett 24: 780-5 (2014)
Article DOI: 10.1016/j.bmcl.2013.12.101
BindingDB Entry DOI: 10.7270/Q2HD7X41