null
SMILES: COc1ccnc(OC)c1C1CCCC(=O)N1Cc1csc(n1)-c1ccccc1
InChI Key: InChIKey=GEPYVZASDQMGCC-UHFFFAOYSA-N
Activity Spreadsheet -- Enzyme Inhibition Constant Data from BindingDB
Found 4 hits for monomerid = 50447803
Trg + Lig
Ki
nM
ΔG°
kcal/mole
IC50
nM
Kd
nM
EC50/IC50
nM
koff
s-1
kon
M-1s-1
pHTemp
°C
Orexin receptor type 2
(Homo sapiens (Human))
BDBM50447803
(CHEMBL3113753 | US9242970, 56)
Show SMILES COc1ccnc(OC)c1C1CCCC(=O)N1Cc1csc(n1)-c1ccccc1
Show InChI InChI=1S/C22H23N3O3S/c1-27-18-11-12-23-21(28-2)20(18)17-9-6-10-19(26)25(17)13-16-14-29-22(24-16)15-7-4-3-5-8-15/h3-5,7-8,11-12,14,17H,6,9-10,13H2,1-2H3
Reactome pathway
US Patent
n/an/a 6n/an/an/an/an/a37
ACTELION PHARMACEUTICALS LTD.
US Patent
Assay Description
In Vitro Assay: Intracellular Calcium Measurements:Chinese hamster ovary (CHO) cells expressing the human orexin-1 receptor and the human orexin-2 re...
US Patent US9242970 (2016)
BindingDB Entry DOI: 10.7270/Q2R49PK4
Orexin/Hypocretin receptor type 1
(Homo sapiens (Human))
BDBM50447803
(CHEMBL3113753 | US9242970, 56)
Show SMILES COc1ccnc(OC)c1C1CCCC(=O)N1Cc1csc(n1)-c1ccccc1
Show InChI InChI=1S/C22H23N3O3S/c1-27-18-11-12-23-21(28-2)20(18)17-9-6-10-19(26)25(17)13-16-14-29-22(24-16)15-7-4-3-5-8-15/h3-5,7-8,11-12,14,17H,6,9-10,13H2,1-2H3
Reactome pathway
n/an/a 141n/an/an/an/an/an/a
Actelion Pharmaceuticals Ltd
Curated by ChEMBL
Assay Description
Antagonist activity at human orexin 1 receptor expressed in CHO cells assessed as inhibition of orexin-A-induced calcium mobilization by FLIPR assay
Bioorg Med Chem Lett 24: 1201-8 (2014)
Article DOI: 10.1016/j.bmcl.2013.12.092
BindingDB Entry DOI: 10.7270/Q2M61MRZ
Orexin receptor type 2
(Homo sapiens (Human))
BDBM50447803
(CHEMBL3113753 | US9242970, 56)
Show SMILES COc1ccnc(OC)c1C1CCCC(=O)N1Cc1csc(n1)-c1ccccc1
Show InChI InChI=1S/C22H23N3O3S/c1-27-18-11-12-23-21(28-2)20(18)17-9-6-10-19(26)25(17)13-16-14-29-22(24-16)15-7-4-3-5-8-15/h3-5,7-8,11-12,14,17H,6,9-10,13H2,1-2H3
Reactome pathway
n/an/a 6n/an/an/an/an/an/a
Actelion Pharmaceuticals Ltd
Curated by ChEMBL
Assay Description
Antagonist activity at human orexin 2 receptor expressed in CHO cells assessed as inhibition of orexin-A-induced calcium mobilization by FLIPR assay
Bioorg Med Chem Lett 24: 1201-8 (2014)
Article DOI: 10.1016/j.bmcl.2013.12.092
BindingDB Entry DOI: 10.7270/Q2M61MRZ
Orexin/Hypocretin receptor type 1
(Homo sapiens (Human))
BDBM50447803
(CHEMBL3113753 | US9242970, 56)
Show SMILES COc1ccnc(OC)c1C1CCCC(=O)N1Cc1csc(n1)-c1ccccc1
Show InChI InChI=1S/C22H23N3O3S/c1-27-18-11-12-23-21(28-2)20(18)17-9-6-10-19(26)25(17)13-16-14-29-22(24-16)15-7-4-3-5-8-15/h3-5,7-8,11-12,14,17H,6,9-10,13H2,1-2H3
Reactome pathway
US Patent
n/an/a 141n/an/an/an/an/a37
ACTELION PHARMACEUTICALS LTD.
US Patent
Assay Description
In Vitro Assay: Intracellular Calcium Measurements:Chinese hamster ovary (CHO) cells expressing the human orexin-1 receptor and the human orexin-2 re...
US Patent US9242970 (2016)
BindingDB Entry DOI: 10.7270/Q2R49PK4