BDBM50447930 CHEMBL3114985
SMILES: COC(=O)Cc1c(C)[nH]n(-c2nc3ccccc3[nH]2)c1=O
InChI Key: InChIKey=IPFYJVKJFSKDNT-UHFFFAOYSA-N
Data: 1 IC50
Activity Spreadsheet -- Enzyme Inhibition Constant Data from BindingDB
Found 1 hit for monomerid = 50447930
Trg + Lig
Ki
nM
ΔG°
kcal/mole
IC50
nM
Kd
nM
EC50/IC50
nM
koff
s-1
kon
M-1s-1
pHTemp
°C
Alpha-ketoglutarate-dependent dioxygenase alkB homolog 3
(Homo sapiens (Human))
BDBM50447930
(CHEMBL3114985)
Show SMILES COC(=O)Cc1c(C)[nH]n(-c2nc3ccccc3[nH]2)c1=O
Show InChI InChI=1S/C14H14N4O3/c1-8-9(7-12(19)21-2)13(20)18(17-8)14-15-10-5-3-4-6-11(10)16-14/h3-6,17H,7H2,1-2H3,(H,15,16)
Reactome pathway
n/an/a 4.30E+3n/an/an/an/an/an/a
Hyogo University of Health Science
Curated by ChEMBL
Assay Description
Inhibition of demethylase activity of PCA-1 (unknown origin) using 3-methyl cytosine oligo DNA as substrate after 1 hr by RT-PCR analysis
Bioorg Med Chem Lett 24: 1071-4 (2014)
Article DOI: 10.1016/j.bmcl.2014.01.008
BindingDB Entry DOI: 10.7270/Q2FF3TVD