BDBM50447932 CHEMBL3114973
SMILES: Cc1[nH]n(-c2nc3ccccc3[nH]2)c(=O)c1C
InChI Key: InChIKey=HBDILVUMAQZKJZ-UHFFFAOYSA-N
Data: 1 IC50
Activity Spreadsheet -- Enzyme Inhibition Constant Data from BindingDB
Found 1 hit for monomerid = 50447932
Trg + Lig
Ki
nM
ΔG°
kcal/mole
IC50
nM
Kd
nM
EC50/IC50
nM
koff
s-1
kon
M-1s-1
pHTemp
°C
Alpha-ketoglutarate-dependent dioxygenase alkB homolog 3
(Homo sapiens (Human))
BDBM50447932
(CHEMBL3114973)
Show SMILES Cc1[nH]n(-c2nc3ccccc3[nH]2)c(=O)c1C
Show InChI InChI=1S/C12H12N4O/c1-7-8(2)15-16(11(7)17)12-13-9-5-3-4-6-10(9)14-12/h3-6,15H,1-2H3,(H,13,14)
Reactome pathway
n/an/a 4.00E+3n/an/an/an/an/an/a
Hyogo University of Health Science
Curated by ChEMBL
Assay Description
Inhibition of demethylase activity of PCA-1 (unknown origin) using 3-methyl cytosine oligo DNA as substrate after 1 hr by RT-PCR analysis
Bioorg Med Chem Lett 24: 1071-4 (2014)
Article DOI: 10.1016/j.bmcl.2014.01.008
BindingDB Entry DOI: 10.7270/Q2FF3TVD