BDBM50447934 CHEMBL3114982
SMILES: Cc1cc(=O)n([nH]1)-c1nc2ccccc2[nH]1
InChI Key: InChIKey=RRXNULSELUJDDO-UHFFFAOYSA-N
Data: 1 IC50
Activity Spreadsheet -- Enzyme Inhibition Constant Data from BindingDB
Found 2 hits for monomerid = 50447934
Trg + Lig
Ki
nM
ΔG°
kcal/mole
IC50
nM
Kd
nM
EC50/IC50
nM
koff
s-1
kon
M-1s-1
pHTemp
°C
Lysine-specific demethylase 4E
(Homo sapiens (Human))
BDBM50447934
(CHEMBL3114982)
Show SMILES Cc1cc(=O)n([nH]1)-c1nc2ccccc2[nH]1
Show InChI InChI=1S/C11H10N4O/c1-7-6-10(16)15(14-7)11-12-8-4-2-3-5-9(8)13-11/h2-6,14H,1H3,(H,12,13)
n/an/a 7.60E+4n/an/an/an/an/an/a
TBA
Citation and Details
Alpha-ketoglutarate-dependent dioxygenase alkB homolog 3
(Homo sapiens (Human))
BDBM50447934
(CHEMBL3114982)
Show SMILES Cc1cc(=O)n([nH]1)-c1nc2ccccc2[nH]1
Show InChI InChI=1S/C11H10N4O/c1-7-6-10(16)15(14-7)11-12-8-4-2-3-5-9(8)13-11/h2-6,14H,1H3,(H,12,13)
Reactome pathway
n/an/a 3.60E+3n/an/an/an/an/an/a
Hyogo University of Health Science
Curated by ChEMBL
Assay Description
Inhibition of demethylase activity of PCA-1 (unknown origin) using 3-methyl cytosine oligo DNA as substrate after 1 hr by RT-PCR analysis
Bioorg Med Chem Lett 24: 1071-4 (2014)
Article DOI: 10.1016/j.bmcl.2014.01.008
BindingDB Entry DOI: 10.7270/Q2FF3TVD