null
SMILES: Cc1[nH]n(-c2nc3ccccc3[nH]2)c(=O)c1Cc1ccc(cc1)-c1ccccc1
InChI Key: InChIKey=ROZAWTSUIYPFPX-UHFFFAOYSA-N
Activity Spreadsheet -- Enzyme Inhibition Constant Data from BindingDB
Found 1 hit for monomerid = 50447947
Trg + Lig
Ki
nM
ΔG°
kcal/mole
IC50
nM
Kd
nM
EC50/IC50
nM
koff
s-1
kon
M-1s-1
pHTemp
°C
Alpha-ketoglutarate-dependent dioxygenase alkB homolog 3
(Homo sapiens (Human))
BDBM50447947
(CHEMBL3115000)
Show SMILES Cc1[nH]n(-c2nc3ccccc3[nH]2)c(=O)c1Cc1ccc(cc1)-c1ccccc1
Show InChI InChI=1S/C24H20N4O/c1-16-20(15-17-11-13-19(14-12-17)18-7-3-2-4-8-18)23(29)28(27-16)24-25-21-9-5-6-10-22(21)26-24/h2-14,27H,15H2,1H3,(H,25,26)
Reactome pathway
n/an/a 720n/an/an/an/an/an/a
Hyogo University of Health Science
Curated by ChEMBL
Assay Description
Inhibition of demethylase activity of PCA-1 (unknown origin) using 3-methyl cytosine oligo DNA as substrate after 1 hr by RT-PCR analysis
Bioorg Med Chem Lett 24: 1071-4 (2014)
Article DOI: 10.1016/j.bmcl.2014.01.008
BindingDB Entry DOI: 10.7270/Q2FF3TVD