null
SMILES: Cc1[nH]n(-c2nc3ccc(C)cc3[nH]2)c(=O)c1Cc1ccccc1
InChI Key: InChIKey=IQOKQFQFGHZHJT-UHFFFAOYSA-N
Activity Spreadsheet -- Enzyme Inhibition Constant Data from BindingDB
Found 1 hit for monomerid = 50447949
Trg + Lig
Ki
nM
ΔG°
kcal/mole
IC50
nM
Kd
nM
EC50/IC50
nM
koff
s-1
kon
M-1s-1
pHTemp
°C
Alpha-ketoglutarate-dependent dioxygenase alkB homolog 3
(Homo sapiens (Human))
BDBM50447949
(CHEMBL3115002)
Show SMILES Cc1[nH]n(-c2nc3ccc(C)cc3[nH]2)c(=O)c1Cc1ccccc1
Show InChI InChI=1S/C19H18N4O/c1-12-8-9-16-17(10-12)21-19(20-16)23-18(24)15(13(2)22-23)11-14-6-4-3-5-7-14/h3-10,22H,11H2,1-2H3,(H,20,21)
Reactome pathway
n/an/a 670n/an/an/an/an/an/a
Hyogo University of Health Science
Curated by ChEMBL
Assay Description
Inhibition of demethylase activity of PCA-1 (unknown origin) using 3-methyl cytosine oligo DNA as substrate after 1 hr by RT-PCR analysis
Bioorg Med Chem Lett 24: 1071-4 (2014)
Article DOI: 10.1016/j.bmcl.2014.01.008
BindingDB Entry DOI: 10.7270/Q2FF3TVD