null
SMILES: Cc1[nH]n(-c2nc3ccccc3[nH]2)c(=O)c1Cc1ccc(F)cc1
InChI Key: InChIKey=FSPWYXGPFRBWDI-UHFFFAOYSA-N
Activity Spreadsheet -- Enzyme Inhibition Constant Data from BindingDB
Found 1 hit for monomerid = 50447953
Trg + Lig
Ki
nM
ΔG°
kcal/mole
IC50
nM
Kd
nM
EC50/IC50
nM
koff
s-1
kon
M-1s-1
pHTemp
°C
Alpha-ketoglutarate-dependent dioxygenase alkB homolog 3
(Homo sapiens (Human))
BDBM50447953
(CHEMBL3114998)
Show SMILES Cc1[nH]n(-c2nc3ccccc3[nH]2)c(=O)c1Cc1ccc(F)cc1
Show InChI InChI=1S/C18H15FN4O/c1-11-14(10-12-6-8-13(19)9-7-12)17(24)23(22-11)18-20-15-4-2-3-5-16(15)21-18/h2-9,22H,10H2,1H3,(H,20,21)
Reactome pathway
n/an/a 600n/an/an/an/an/an/a
Hyogo University of Health Science
Curated by ChEMBL
Assay Description
Inhibition of demethylase activity of PCA-1 (unknown origin) using 3-methyl cytosine oligo DNA as substrate after 1 hr by RT-PCR analysis
Bioorg Med Chem Lett 24: 1071-4 (2014)
Article DOI: 10.1016/j.bmcl.2014.01.008
BindingDB Entry DOI: 10.7270/Q2FF3TVD